4-Chlorobenzenesulfonic acid

Phase change data

Data compiled by: William E. Acree, Jr., James S. Chickos

Enthalpy of fusion

ΔfusH (kJ/mol) Temperature (K) Method Reference
10.6333.2DSCMacnab and Joy, 1995

References

Macnab and Joy, 1995
Macnab, J.I.; Joy, J.A., Thermodynamics of the 4-chlorobenzene sulphonic acid-water system, Thermochimica Acta, 1995, 259, 1, 31-40, https://doi.org/10.1016/0040-6031(95)02270-C . [all data]