p-tert.-Butylcatechol
- Formula: C10H14O2
- Molecular weight: 166.2170
- IUPAC Standard InChIKey: XESZUVZBAMCAEJ-UHFFFAOYSA-N
- CAS Registry Number: 98-29-3
- Chemical structure:
View 3d structure (requires JavaScript / HTML 5) - Other names: 1,2-Benzenediol, 4-(1,1-dimethylethyl)-; Pyrocatechol, 4-tert-butyl-; p-tert-Butylcatechol; p-tert-Butylpyrocatechol; 1,2-Dihydroxy-4-tert-butylbenzene; 4-tert-Butyl-1,2-benzenediol; 4-tert-Butyl-1,2-dihydroxybenzene; 4-tert-Butylcatechin; 4-tert-Butylcatechol; 4-tert-Butylpyrocatechol; p-t-Butyl catechol; 4-t-Butylcatechol; p-t-Butylpyrocatechol; 4-t-Butylpyrocatechol; 4-tert-Butylpyrokatechin; Synox TBC; 4-t-Butyl-1,2-benzenediol; 4-TBC; NSC 5310

Gas phase thermochemistry data

Data compiled by: Hussein Y. Afeefy, Joel F. Liebman, and Stephen E. Stein
Quantity | Value | Units | Method | Reference | Comment |
---|---|---|---|---|---|
ΔfH°gas | -374.7 ± 2.1 | kJ/mol | Ccb | Ribeiro Da Silva and Ribeiro Da Silva, 1984 |

Condensed phase thermochemistry data

Data compiled by: Hussein Y. Afeefy, Joel F. Liebman, and Stephen E. Stein
Quantity | Value | Units | Method | Reference | Comment |
---|---|---|---|---|---|
ΔfH°solid | -474.0 ± 1.6 | kJ/mol | Ccb | Ribeiro Da Silva and Ribeiro Da Silva, 1984 | |
Quantity | Value | Units | Method | Reference | Comment |
ΔcH°solid | -5461.9 ± 0.9 | kJ/mol | Ccb | Ribeiro Da Silva and Ribeiro Da Silva, 1984 | Corresponding ΔfHºsolid = -474.0 kJ/mol (simple calculation by NIST; no Washburn corrections) |

Phase change data

Data compiled as indicated in comments:
BS - Robert L. Brown and Stephen E. Stein
TRC - Thermodynamics Research Center, NIST Boulder Laboratories, Chris Muzny director
AC - William E. Acree, Jr., James S. Chickos
ALS - Hussein Y. Afeefy, Joel F. Liebman, and Stephen E. Stein
DRB - Donald R. Burgess, Jr.
Quantity | Value | Units | Method | Reference | Comment |
---|---|---|---|---|---|
Tboil | 558.2 | K | N/A | Weast and Grasselli, 1989 | BS |
Quantity | Value | Units | Method | Reference | Comment |
Ttriple | 327. | K | N/A | Steele, Chirico, et al., 1997 | Uncertainty assigned by TRC = 2. K; TRC |
Quantity | Value | Units | Method | Reference | Comment |
Tc | 775. | K | N/A | Steele, Chirico, et al., 1997 | Uncertainty assigned by TRC = 6. K; TRC |
Quantity | Value | Units | Method | Reference | Comment |
Pc | 37.00 | bar | N/A | Steele, Chirico, et al., 1997 | Uncertainty assigned by TRC = 3.00 bar; derived from fit of obs. vapor pressure; TRC |
Quantity | Value | Units | Method | Reference | Comment |
ρc | 1.79 | mol/l | N/A | Steele, Chirico, et al., 1997 | Uncertainty assigned by TRC = 0.090 mol/l; TRC |
Quantity | Value | Units | Method | Reference | Comment |
ΔvapH° | 96.5 ± 2.8 | kJ/mol | EB | Steele, Chirico, et al., 1997, 2 | Based on data from 439. to 516. K.; AC |
Quantity | Value | Units | Method | Reference | Comment |
ΔsubH° | 99.2 ± 0.9 | kJ/mol | GS | Verevkin and Schick, 2000 | AC |
ΔsubH° | 99.3 ± 1.4 | kJ/mol | C | Carson, 1984 | AC |
ΔsubH° | 99.3 ± 1.4 | kJ/mol | C | Ribeiro Da Silva and Ribeiro Da Silva, 1984 | ALS |
ΔsubH° | 99.3 | kJ/mol | N/A | Ribeiro Da Silva and Ribeiro Da Silva, 1984 | DRB |
Enthalpy of sublimation
ΔsubH (kJ/mol) | Temperature (K) | Method | Reference | Comment |
---|---|---|---|---|
98.7 ± 0.9 | 313. | GS | Verevkin and Schick, 2000 | AC |
Enthalpy of fusion
ΔfusH (kJ/mol) | Temperature (K) | Reference | Comment |
---|---|---|---|
15.1 | 330.4 | Verevkin and Schick, 2000 | AC |

References

Ribeiro Da Silva and Ribeiro Da Silva, 1984
Ribeiro Da Silva, M.D.M.C.; Ribeiro Da Silva, M.A.V.,
Enthalpies of combustion of 1,2-dihydroxybenzene and of six alkylsubstituted 1,2-dihydroxybenzenes,
J. Chem. Thermodyn., 1984, 16, 1149-1155. [all data]
Weast and Grasselli, 1989
CRC Handbook of Data on Organic Compounds, 2nd Editon, Weast,R.C and Grasselli, J.G., ed(s)., CRC Press, Inc., Boca Raton, FL, 1989, 1. [all data]
Steele, Chirico, et al., 1997
Steele, W.V.; Chirico, R.D.; Knipmeyer, S.E.; Nguyen, A.,
Vapor Pressure, Heat Capacity, and Density along the Saturated Line, Measurements for Dimethyl Isophthalate, Dimethyl Carbonate, 1,3,5-Trimethyl benzene, Pentafluorophenol, 4-tert-Butylcatechol, .alp,
J. Chem. Eng. Data, 1997, 42, 1008-20. [all data]
Steele, Chirico, et al., 1997, 2
Steele, W.V.; Chirico, R.D.; Knipmeyer, S.E.; Nguyen, A.,
Vapor Pressure, Heat Capacity, and Density along the Saturation Line, Measurements for Dimethyl Isophthalate, Dimethyl Carbonate, 1,3,5-Triethylbenzene, Pentafluorophenol, 4- tert -Butylcatechol, α-Methylstyrene, and N , N '-Bis(2-hydroxyethyl)ethylenediamine,
J. Chem. Eng. Data, 1997, 42, 6, 1008-1020, https://doi.org/10.1021/je970102d
. [all data]
Verevkin and Schick, 2000
Verevkin, Sergey P.; Schick, Christoph,
Substituent Effects on the Benzene Ring. Determination of the Intramolecular Interactions of Substituents in tert -Alkyl-Substituted Catechols from Thermochemical Measurements,
J. Chem. Eng. Data, 2000, 45, 5, 946-952, https://doi.org/10.1021/je0001126
. [all data]
Carson, 1984
Carson, A.S.,
The molar enthalpy of dehydration of Cr2(O2CCH3)4·2H2O(cr) and the molar enthalpies of sublimation of Cr2(O2CCH3)4(cr), Mo2(O2CCH3)4(cr), and Mo2(O2CCF3)4(cr),
The Journal of Chemical Thermodynamics, 1984, 16, 5, 427-429, https://doi.org/10.1016/0021-9614(84)90198-8
. [all data]