Phenol, 4-(1,1-dimethylethyl)-2-methyl-
- Formula: C11H16O
- Molecular weight: 164.2441
- IUPAC Standard InChIKey: SNKLPZOJLXDZCW-UHFFFAOYSA-N
- CAS Registry Number: 98-27-1
- Chemical structure:
View 3d structure (requires JavaScript / HTML 5) - Other names: o-Cresol, 4-tert-butyl-; p-tert-Butyl-o-cresol; 2-Methyl-4-tert-butylphenol; 4-tert-Butyl-o-Cresol; 4-tert-Butyl-2-Methylphenol; Phenol, 4-tert-butyl-2-methyl-

Phase change data

Data compiled by: William E. Acree, Jr., James S. Chickos
Quantity | Value | Units | Method | Reference | Comment |
---|---|---|---|---|---|
ΔvapH° | 72.1 ± 0.6 | kJ/mol | GS | Verevkin, 1999 | Based on data from 291. to 333. K. |
Enthalpy of vaporization
ΔvapH (kJ/mol) | Temperature (K) | Method | Reference | Comment |
---|---|---|---|---|
71.3 ± 0.6 | 312. | GS | Verevkin, 1999 | Based on data from 291. to 333. K. |
61.5 | 362. | A | Stephenson and Malanowski, 1987 | Based on data from 347. to 520. K. |
75.7 | 286. | A | Stephenson and Malanowski, 1987 | Based on data from 275. to 297. K. See also Aihara, 1960. |
55.7 | 348. | N/A | Stage, Müller, et al., 1953 | Based on data from 347. to 532. K. |
53.9 | 373. | N/A | Stage, Müller, et al., 1953 | Based on data from 347. to 532. K. |
53.2 | 398. | N/A | Stage, Müller, et al., 1953 | Based on data from 347. to 532. K. |
50.9 | 423. | N/A | Stage, Müller, et al., 1953 | Based on data from 347. to 532. K. |
46.7 | 473. | N/A | Stage, Müller, et al., 1953 | Based on data from 347. to 532. K. |

Reaction thermochemistry data

Data compiled by: Hussein Y. Afeefy, Joel F. Liebman, and Stephen E. Stein
Individual Reactions
By formula: C15H24O + C7H8O = C11H16O + C11H16O
Quantity | Value | Units | Method | Reference | Comment |
---|---|---|---|---|---|
ΔrH° | 2.5 ± 3.5 | kJ/mol | Eqk | Nesterova, Verevkin, et al., 1985 | liquid phase |
By formula: C11H16O = C11H16O
Quantity | Value | Units | Method | Reference | Comment |
---|---|---|---|---|---|
ΔrH° | -17.5 ± 1.2 | kJ/mol | Eqk | Nesterova, Verevkin, et al., 1985 | liquid phase |

Van Den Dool and Kratz RI, non-polar column, temperature ramp

Column type | Active phase | I | Reference | Comment |
---|---|---|---|---|
Capillary | OV-1 | 1333.6 | Gautzsch and Zinn, 1996 | 8. K/min; Tstart: 35. C; Tend: 300. C |

References

Verevkin, 1999
Verevkin, S.P.,
Thermochemistry of phenols: quantification of theortho-,para-, andmeta-interactions in tert-alkyl substituted phenols,
The Journal of Chemical Thermodynamics, 1999, 31, 5, 559-585, https://doi.org/10.1006/jcht.1998.0459
. [all data]
Stephenson and Malanowski, 1987
Stephenson, Richard M.; Malanowski, Stanislaw,
Handbook of the Thermodynamics of Organic Compounds, 1987, https://doi.org/10.1007/978-94-009-3173-2
. [all data]
Aihara, 1960
Aihara, Ariyuki,
Estimation of the Energy of Hydrogen Bonds Formed in Crystals. II. Phenols,
Bull. Chem. Soc. Jpn., 1960, 33, 2, 194-200, https://doi.org/10.1246/bcsj.33.194
. [all data]
Stage, Müller, et al., 1953
Stage, H.; Müller, E.; Faldix, P.,
Erdol u Kohle, 1953, 6, 375. [all data]
Nesterova, Verevkin, et al., 1985
Nesterova, T.N.; Verevkin, S.P.; Malova, T.N.; Pilshchikov, V.A.,
Study of an equilibrium of tert-alkylphenols (thermodynamic analysis of the alkylation of phenols by branched olefins),
Zh. Prikl. Khim. (Leningrad), 1985, 58, 827-833. [all data]
Gautzsch and Zinn, 1996
Gautzsch, R.; Zinn, P.,
Use of incremental models to estimate the retention indexes of aromatic compounds,
Chromatographia, 1996, 43, 3/4, 163-176, https://doi.org/10.1007/BF02292946
. [all data]