2-pentene, 3-(1-methylethyl)-4-methyl-
- Formula: C9H18
- Molecular weight: 126.2392
- IUPAC Standard InChIKey: KQSYWHYSURZJEU-UHFFFAOYSA-N
- CAS Registry Number: 98260-13-0
- Chemical structure:
View 3d structure (requires JavaScript / HTML 5) - Permanent link for this species. Use this link for bookmarking this species for future reference.

Phase change data

Data compiled by: Thermodynamics Research Center, NIST Boulder Laboratories, Chris Muzny director
Quantity | Value | Units | Method | Reference | Comment |
---|---|---|---|---|---|
Tboil | 411.15 | K | N/A | Howard, Mears, et al., 1947 | Uncertainty assigned by TRC = 0.2 K |

References

Howard, Mears, et al., 1947
Howard, F.L.; Mears, T.W.; Fookson, A.; Pomerantz, P.; Brooks, D.B.,
Preparation and physical properties of several aliphatic hydrocarbons and intermediates,
J. Res. Natl. Bur. Stand. (U. S.), 1947, 38, 365. [all data]