1-Chloro-2,6-diisopropyl-4-methylbenzene

Reaction thermochemistry data

Data compiled by: Hussein Y. Afeefy, Joel F. Liebman, and Stephen E. Stein

Individual Reactions

1-Chloro-2,6-diisopropyl-4-methylbenzene = 1-Chloro-2,5-diisopropyl-4-methylbenzene

By formula: C13H19Cl = C13H19Cl

Quantity Value Units Method Reference Comment
Δr0.43 ± 0.17kJ/molEqkNesterova, Rozhnov, et al., 1985liquid phase

References

Nesterova, Rozhnov, et al., 1985
Nesterova, T.N.; Rozhnov, A.M.; Malova, T.N.; Kovzel, E.N., Molar enthalpies of formation of isopropylchlorobenzenes derived from equilibrium measurements, J. Chem. Thermodyn., 1985, 17, 649-656. [all data]