Phenol, 3-(trifluoromethyl)-
- Formula: C7H5F3O
- Molecular weight: 162.1092
- IUPAC Standard InChIKey: UGEJOEBBMPOJMT-UHFFFAOYSA-N
- CAS Registry Number: 98-17-9
- Chemical structure:
View 3d structure (requires JavaScript / HTML 5) - Other names: m-Cresol, α,α,α-trifluoro-; α,α,α-Trifluoro-m-cresol; m-(Trifluoromethyl)phenol; m-Hydroxybenzotrifluoride; 3-(Trifluoromethyl)phenol; 3-Hydroxybenzotrifluoride

Condensed phase thermochemistry data

Data compiled by: Hussein Y. Afeefy, Joel F. Liebman, and Stephen E. Stein
Quantity | Value | Units | Method | Reference | Comment |
---|---|---|---|---|---|
ΔcH°liquid | -3193.9 | kJ/mol | Ccb | Swarts, 1919 | Not corrected for CODATA value of ΔfH |

Phase change data

Data compiled by: Robert L. Brown and Stephen E. Stein
Quantity | Value | Units | Method | Reference | Comment |
---|---|---|---|---|---|
Tboil | 451. | K | N/A | PCR Inc., 1990 | |
Tboil | 451.2 | K | N/A | Weast and Grasselli, 1989 | |
Tboil | 451. to 452. | K | N/A | Frinton Laboratories Inc., 1986 |

Reaction thermochemistry data

Data compiled as indicated in comments:
B - John E. Bartmess
M - Michael M. Meot-Ner (Mautner) and Sharon G. Lias
Individual Reactions
By formula: Br- + C7H5F3O = (Br- • C7H5F3O)
Quantity | Value | Units | Method | Reference | Comment |
---|---|---|---|---|---|
ΔrH° | 108. ± 7.5 | kJ/mol | IMRE | Paul and Kebarle, 1990 | gas phase; ΔGaff at 423 K; B |
ΔrH° | 52.7 | kJ/mol | PHPMS | Paul and Kebarle, 1991 | gas phase; Entropy change calculated or estimated; M |
Quantity | Value | Units | Method | Reference | Comment |
ΔrS° | 84. | J/mol*K | N/A | Paul and Kebarle, 1991 | gas phase; Entropy change calculated or estimated; M |
Quantity | Value | Units | Method | Reference | Comment |
ΔrG° | 66.9 ± 4.2 | kJ/mol | IMRE | Paul and Kebarle, 1990 | gas phase; ΔGaff at 423 K; B |
Free energy of reaction
ΔrG° (kJ/mol) | T (K) | Method | Reference | Comment |
---|---|---|---|---|
17. | 423. | PHPMS | Paul and Kebarle, 1991 | gas phase; Entropy change calculated or estimated; M |
C7H4F3O- + =
By formula: C7H4F3O- + H+ = C7H5F3O
Quantity | Value | Units | Method | Reference | Comment |
---|---|---|---|---|---|
ΔrH° | 1419. ± 8.8 | kJ/mol | G+TS | Fujio, McIver, et al., 1981 | gas phase; value altered from reference due to change in acidity scale; B |
Quantity | Value | Units | Method | Reference | Comment |
ΔrG° | 1391. ± 8.4 | kJ/mol | IMRE | Fujio, McIver, et al., 1981 | gas phase; value altered from reference due to change in acidity scale; B |

Gas phase ion energetics data

Data compiled by: John E. Bartmess
De-protonation reactions
C7H4F3O- + =
By formula: C7H4F3O- + H+ = C7H5F3O
Quantity | Value | Units | Method | Reference | Comment |
---|---|---|---|---|---|
ΔrH° | 1419. ± 8.8 | kJ/mol | G+TS | Fujio, McIver, et al., 1981 | gas phase; value altered from reference due to change in acidity scale |
Quantity | Value | Units | Method | Reference | Comment |
ΔrG° | 1391. ± 8.4 | kJ/mol | IMRE | Fujio, McIver, et al., 1981 | gas phase; value altered from reference due to change in acidity scale |

Ion clustering data

Data compiled as indicated in comments:
B - John E. Bartmess
M - Michael M. Meot-Ner (Mautner) and Sharon G. Lias
Clustering reactions
By formula: Br- + C7H5F3O = (Br- • C7H5F3O)
Quantity | Value | Units | Method | Reference | Comment |
---|---|---|---|---|---|
ΔrH° | 108. ± 7.5 | kJ/mol | IMRE | Paul and Kebarle, 1990 | gas phase; ΔGaff at 423 K; B |
ΔrH° | 52.7 | kJ/mol | PHPMS | Paul and Kebarle, 1991 | gas phase; Entropy change calculated or estimated; M |
Quantity | Value | Units | Method | Reference | Comment |
ΔrS° | 84. | J/mol*K | N/A | Paul and Kebarle, 1991 | gas phase; Entropy change calculated or estimated; M |
Quantity | Value | Units | Method | Reference | Comment |
ΔrG° | 66.9 ± 4.2 | kJ/mol | IMRE | Paul and Kebarle, 1990 | gas phase; ΔGaff at 423 K; B |
Free energy of reaction
ΔrG° (kJ/mol) | T (K) | Method | Reference | Comment |
---|---|---|---|---|
17. | 423. | PHPMS | Paul and Kebarle, 1991 | gas phase; Entropy change calculated or estimated; M |

References

Swarts, 1919
Swarts, F.,
Etudes thermochimiques sur les combinaisons organiques fluorees,
J. Chim. Phys., 1919, 17, 3-70. [all data]
PCR Inc., 1990
PCR Inc.,
Research Chemicals Catalog 1990-1991, PCR Inc., Gainesville, FL, 1990, 1. [all data]
Weast and Grasselli, 1989
CRC Handbook of Data on Organic Compounds, 2nd Editon, Weast,R.C and Grasselli, J.G., ed(s)., CRC Press, Inc., Boca Raton, FL, 1989, 1. [all data]
Frinton Laboratories Inc., 1986
Frinton Laboratories Inc.,
Catalog Number 11, Frinton Laboratories Inc., Vineland, NJ, 1986, 99. [all data]
Paul and Kebarle, 1990
Paul, G.J.C.; Kebarle, P.,
Stabilities in the Gas Phase of the Hydrogen Bonded Complexes, YC6H4OH-X-, of Substituted Phenols, YC6H4OH, with the Halide Anions X-(Cl-, Br-),
Can. J. Chem., 1990, 68, 11, 2070, https://doi.org/10.1139/v90-316
. [all data]
Paul and Kebarle, 1991
Paul, G.J.C.; Kebarle, P.,
Stabilities of Complexes of Br- with Substituted Benzenes (SB) Based on Determinations of the Gas-Phase Equilibria Br- + SB = (BrSB)-,
J. Am. Chem. Soc., 1991, 113, 4, 1148, https://doi.org/10.1021/ja00004a014
. [all data]
Fujio, McIver, et al., 1981
Fujio, M.; McIver, R.T., Jr.; Taft, R.W.,
Effects on the acidities of phenols from specific substituent-solvent interactions. Inherent substituent parameters from gas phase acidities,
J. Am. Chem. Soc., 1981, 103, 4017. [all data]