Benzenamine, 3-(trifluoromethyl)-
- Formula: C7H6F3N
- Molecular weight: 161.1244
- IUPAC Standard InChIKey: VIUDTWATMPPKEL-UHFFFAOYSA-N
- CAS Registry Number: 98-16-8
- Chemical structure:
View 3d structure (requires JavaScript / HTML 5) - Other names: m-Toluidine, α,α,α-trifluoro-; α,α,α-Trifluoro-m-toluidine; m-(Trifluoromethyl)aniline; m-Amino-α,α,α-trifluorotoluene; m-Aminobenzal fluoride; m-Aminobenzotrifluoride; 1-Amino-3-(trifluoromethyl)benzene; 3-(Trifluoromethyl)aniline; 3-(Trifluoromethyl)benzenamine; 3-Aminobenzotrifluoride; 3-Trifluromethylaniline; Toluene, 3-amino-α,α,α-trifluoro-,; USAF ma-4; m-Abtf; UN 2948; NSC 4540

Condensed phase thermochemistry data

Data compiled by: Hussein Y. Afeefy, Joel F. Liebman, and Stephen E. Stein
Quantity | Value | Units | Method | Reference | Comment |
---|---|---|---|---|---|
ΔfH°liquid | -686.01 | kJ/mol | Ccb | Swarts, 1909 | |
Quantity | Value | Units | Method | Reference | Comment |
ΔcH°liquid | -3476.7 | kJ/mol | Ccb | Swarts, 1919 | Not corrected for CODATA value of ΔfH |
ΔcH°liquid | -3455. | kJ/mol | Ccb | Swarts, 1909 |

Phase change data

Data compiled as indicated in comments:
BS - Robert L. Brown and Stephen E. Stein
AC - William E. Acree, Jr., James S. Chickos
Quantity | Value | Units | Method | Reference | Comment |
---|---|---|---|---|---|
Tboil | 460.2 | K | N/A | Aldrich Chemical Company Inc., 1990 | BS |
Tboil | 459. to 460. | K | N/A | Frinton Laboratories Inc., 1986 | BS |
Reduced pressure boiling point
Tboil (K) | Pressure (bar) | Reference | Comment |
---|---|---|---|
358.8 | 0.027 | PCR Inc., 1990 | BS |
Enthalpy of vaporization
ΔvapH (kJ/mol) | Temperature (K) | Method | Reference | Comment |
---|---|---|---|---|
53.1 | 349. | A | Stephenson and Malanowski, 1987 | Based on data from 334. to 464. K. See also Kardon and Saylor, 1953 and Dykyj, Svoboda, et al., 1999.; AC |

Reaction thermochemistry data

Data compiled as indicated in comments:
B - John E. Bartmess
ALS - Hussein Y. Afeefy, Joel F. Liebman, and Stephen E. Stein
Individual Reactions
C7H5F3N- + =
By formula: C7H5F3N- + H+ = C7H6F3N
Quantity | Value | Units | Method | Reference | Comment |
---|---|---|---|---|---|
ΔrH° | 1493. ± 8.8 | kJ/mol | G+TS | Bartmess, Scott, et al., 1979 | gas phase; value altered from reference due to change in acidity scale; B |
Quantity | Value | Units | Method | Reference | Comment |
ΔrG° | 1463. ± 8.4 | kJ/mol | IMRE | Bartmess, Scott, et al., 1979 | gas phase; value altered from reference due to change in acidity scale; B |
By formula: C15H10F6N2O = C8H4F3NO + C7H6F3N
Quantity | Value | Units | Method | Reference | Comment |
---|---|---|---|---|---|
ΔrH° | 195.2 ± 6.1 | kJ/mol | Eqk | Chimishkyan, Svetlova, et al., 1984 | solid phase; Dissociation; ALS |

Gas phase ion energetics data

Data evaluated as indicated in comments:
HL - Edward P. Hunter and Sharon G. Lias
Data compiled as indicated in comments:
B - John E. Bartmess
Quantity | Value | Units | Method | Reference | Comment |
---|---|---|---|---|---|
Proton affinity (review) | 856.9 | kJ/mol | N/A | Hunter and Lias, 1998 | HL |
Quantity | Value | Units | Method | Reference | Comment |
Gas basicity | 825.1 | kJ/mol | N/A | Hunter and Lias, 1998 | HL |
De-protonation reactions
C7H5F3N- + =
By formula: C7H5F3N- + H+ = C7H6F3N
Quantity | Value | Units | Method | Reference | Comment |
---|---|---|---|---|---|
ΔrH° | 1493. ± 8.8 | kJ/mol | G+TS | Bartmess, Scott, et al., 1979 | gas phase; value altered from reference due to change in acidity scale; B |
Quantity | Value | Units | Method | Reference | Comment |
ΔrG° | 1463. ± 8.4 | kJ/mol | IMRE | Bartmess, Scott, et al., 1979 | gas phase; value altered from reference due to change in acidity scale; B |

Van Den Dool and Kratz RI, non-polar column, temperature ramp

Column type | Active phase | I | Reference | Comment |
---|---|---|---|---|
Capillary | OV-1 | 1017.6 | Gautzsch and Zinn, 1996 | 8. K/min; Tstart: 35. C; Tend: 300. C |

References

Swarts, 1909
Swarts, M.F.,
Sur la chaleur de formation de quelquesuns compounds organiques fluords,
Recl. Trav. Chim. Pays-Bas, 1909, 28, 143-154. [all data]
Swarts, 1919
Swarts, F.,
Etudes thermochimiques sur les combinaisons organiques fluorees,
J. Chim. Phys., 1919, 17, 3-70. [all data]
Aldrich Chemical Company Inc., 1990
Aldrich Chemical Company Inc.,
Catalog Handbook of Fine Chemicals, Aldrich Chemical Company, Inc., Milwaukee WI, 1990, 1. [all data]
Frinton Laboratories Inc., 1986
Frinton Laboratories Inc.,
Catalog Number 11, Frinton Laboratories Inc., Vineland, NJ, 1986, 99. [all data]
PCR Inc., 1990
PCR Inc.,
Research Chemicals Catalog 1990-1991, PCR Inc., Gainesville, FL, 1990, 1. [all data]
Stephenson and Malanowski, 1987
Stephenson, Richard M.; Malanowski, Stanislaw,
Handbook of the Thermodynamics of Organic Compounds, 1987, https://doi.org/10.1007/978-94-009-3173-2
. [all data]
Kardon and Saylor, 1953
Kardon, Samuel; Saylor, John H.,
The Vapor Pressures of Some Substituted Benzotrifluorides 1,
J. Am. Chem. Soc., 1953, 75, 8, 1997-1997, https://doi.org/10.1021/ja01104a512
. [all data]
Dykyj, Svoboda, et al., 1999
Dykyj, J.; Svoboda, J.; Wilhoit, R.C.; Frenkel, M.L.; Hall, K.R.,
Vapor Pressure of Chemicals: Part A. Vapor Pressure and Antoine Constants for Hydrocarbons and Sulfur, Selenium, Tellurium and Hydrogen Containing Organic Compounds, Springer, Berlin, 1999, 373. [all data]
Bartmess, Scott, et al., 1979
Bartmess, J.E.; Scott, J.A.; McIver, R.T., Jr.,
The gas phase acidity scale from methanol to phenol,
J. Am. Chem. Soc., 1979, 101, 6047. [all data]
Chimishkyan, Svetlova, et al., 1984
Chimishkyan, A.L.; Svetlova, L.P.; Leonova, T.V.; Gluyaev, N.D.,
Thermal decomposition of substituted ureas,
J. Gen. Chem. USSR, 1984, 54, 1317-1320. [all data]
Hunter and Lias, 1998
Hunter, E.P.; Lias, S.G.,
Evaluated Gas Phase Basicities and Proton Affinities of Molecules: An Update,
J. Phys. Chem. Ref. Data, 1998, 27, 3, 413-656, https://doi.org/10.1063/1.556018
. [all data]
Land (editor), 1973
Land (editor), L.,
Absorption Spectra in the Ultraviolet and Visible Region, 1973, 18, 47. [all data]
Gautzsch and Zinn, 1996
Gautzsch, R.; Zinn, P.,
Use of incremental models to estimate the retention indexes of aromatic compounds,
Chromatographia, 1996, 43, 3/4, 163-176, https://doi.org/10.1007/BF02292946
. [all data]