1,2,5-Pentanetriol trinitrate
- Formula: C5H9N3O9
- Molecular weight: 255.1397
- IUPAC Standard InChIKey: NOTDFOCRTLYINY-UHFFFAOYSA-N
- CAS Registry Number: 98071-55-7
- Chemical structure:
View 3d structure (requires JavaScript / HTML 5) - Permanent link for this species. Use this link for bookmarking this species for future reference.

Condensed phase thermochemistry data

Data compiled by: Hussein Y. Afeefy, Joel F. Liebman, and Stephen E. Stein
Quantity | Value | Units | Method | Reference | Comment |
---|---|---|---|---|---|
ΔcH°liquid | -2814. | kJ/mol | Ccb | Handrick, 1956 | Naval Powder Factory, 1951 |

Phase change data

Data compiled by: William E. Acree, Jr., James S. Chickos
Enthalpy of vaporization
ΔvapH (kJ/mol) | Temperature (K) | Method | Reference | Comment |
---|---|---|---|---|
41.7 ± 2.1 | 303. | A,GS | Stephenson and Malanowski, 1987 | Based on data from 293. to 313. K. See also Kemp, Goldhagen, et al., 1957. |

References

Handrick, 1956
Handrick, G.R.,
Report of the study of pure explosive compounds. Part IV. Calculation of heat of combustion of organic compounds from structural features and calculation of power of high explosives, Rpt. C-58247 for the Office of the Chief of Ordnance, contract DA-19-020-ORD-47 by the Arthur D. Little, Inc., Cambridge, MA, 1956, 467-573. [all data]
Stephenson and Malanowski, 1987
Stephenson, Richard M.; Malanowski, Stanislaw,
Handbook of the Thermodynamics of Organic Compounds, 1987, https://doi.org/10.1007/978-94-009-3173-2
. [all data]
Kemp, Goldhagen, et al., 1957
Kemp, M.D.; Goldhagen, S.; Zihlman, F.A.,
Vapor Pressures and Cryoscopic Data for Some Aliphatic Dinitroxy and Trinitroxy Compounds,
J. Phys. Chem., 1957, 61, 2, 240-242, https://doi.org/10.1021/j150548a021
. [all data]