2-Furanmethanol
- Formula: C5H6O2
- Molecular weight: 98.0999
- IUPAC Standard InChIKey: XPFVYQJUAUNWIW-UHFFFAOYSA-N
- CAS Registry Number: 98-00-0
- Chemical structure:
View 3d structure (requires JavaScript / HTML 5) - Other names: Furfuryl alcohol; α-Furfuryl alcohol; α-Furylcarbinol; Furfuralcohol; Furyl alcohol; Furylcarbinol; 2-(Hydroxymethyl)furan; 2-Furancarbinol; 2-Furanylmethanol; 2-Furfuryl alcohol; 2-Furylcarbinol; 2-Furylmethanol; 5-Hydroxymethylfuran; Furfural alcohol; Methanol, (2-furyl)-; NCI-C56224; 2-Furfurylalkohol; UN 2874; Qo furfuryl alcohol; 2-Furanemethanol; Furfurol; 2-Hydroxymethylfurane; Furan-2-methanol; Furfuranol; NSC 8843; furfuryl alcohol (furfurol); furanmethanol; 2-Furanmethanol (furfuryl alcohol); 2-Furane-methanol (furfurol)

Gas phase thermochemistry data

Data compiled as indicated in comments:
DRB - Donald R. Burgess, Jr.
ALS - Hussein Y. Afeefy, Joel F. Liebman, and Stephen E. Stein
Quantity | Value | Units | Method | Reference | Comment |
---|---|---|---|---|---|
ΔfH°gas | -212.0 | kJ/mol | N/A | Parks, Mosley, et al., 1950 | Value computed using ΔfHliquid° value of -276.4 kj/mol from Parks, Mosley, et al., 1950 and ΔvapH° value of 64.4 kj/mol from Landrieu, Baylocq, et al., 1929.; DRB |
ΔfH°gas | -212.6 | kJ/mol | N/A | Miller, 1936 | Value computed using ΔfHliquid° value of -277.0 kj/mol from Miller, 1936 and ΔvapH° value of 64.4 kj/mol from Landrieu, Baylocq, et al., 1929.; DRB |
ΔfH°gas | -211.8 ± 2.1 | kJ/mol | Ccb | Landrieu, Baylocq, et al., 1929 | Heat of formation derived by Cox and Pilcher, 1970; ALS |

Condensed phase thermochemistry data

Data compiled as indicated in comments:
ALS - Hussein Y. Afeefy, Joel F. Liebman, and Stephen E. Stein
DH - Eugene S. Domalski and Elizabeth D. Hearing
Quantity | Value | Units | Method | Reference | Comment |
---|---|---|---|---|---|
ΔfH°liquid | -276.4 | kJ/mol | Ccb | Parks, Mosley, et al., 1950 | ALS |
ΔfH°liquid | -277. | kJ/mol | Ccb | Miller, 1936 | %hf calculated possible error by author; ALS |
ΔfH°liquid | -276.2 ± 1.3 | kJ/mol | Ccb | Landrieu, Baylocq, et al., 1929 | Reanalyzed by Cox and Pilcher, 1970, Original value = -285. kJ/mol; ALS |
Quantity | Value | Units | Method | Reference | Comment |
ΔcH°liquid | -2548.7 | kJ/mol | Ccb | Parks, Mosley, et al., 1950 | Corresponding ΔfHºliquid = -276.3 kJ/mol (simple calculation by NIST; no Washburn corrections); ALS |
ΔcH°liquid | -2548. | kJ/mol | Ccb | Miller, 1936 | %hf calculated possible error by author; Corresponding ΔfHºliquid = -277. kJ/mol (simple calculation by NIST; no Washburn corrections); ALS |
ΔcH°liquid | -2540. | kJ/mol | Ccb | Landrieu, Baylocq, et al., 1929 | Corresponding ΔfHºliquid = -285. kJ/mol (simple calculation by NIST; no Washburn corrections); ALS |
Quantity | Value | Units | Method | Reference | Comment |
S°liquid | 215.9 | J/mol*K | N/A | Parks, Kennedy, et al., 1956 | Extrapolation below 80 K, 48.99 J/mol*K.; DH |
S°liquid | 215.5 | J/mol*K | N/A | Miller, 1935 | Extrapolation below 90 K, 42.97 J/mol*K.; DH |
Constant pressure heat capacity of liquid
Cp,liquid (J/mol*K) | Temperature (K) | Reference | Comment |
---|---|---|---|
204.01 | 298.15 | Parks, Kennedy, et al., 1956 | T = 90 to 300 K.; DH |
193.3 | 303. | Hough, Mason, et al., 1950 | T = 303 to 333 K.; DH |

Phase change data

Data compiled as indicated in comments:
BS - Robert L. Brown and Stephen E. Stein
TRC - Thermodynamics Research Center, NIST Boulder Laboratories, Chris Muzny director
ALS - Hussein Y. Afeefy, Joel F. Liebman, and Stephen E. Stein
DRB - Donald R. Burgess, Jr.
AC - William E. Acree, Jr., James S. Chickos
DH - Eugene S. Domalski and Elizabeth D. Hearing
Quantity | Value | Units | Method | Reference | Comment |
---|---|---|---|---|---|
Tboil | 430. ± 70. | K | AVG | N/A | Average of 6 values; Individual data points |
Quantity | Value | Units | Method | Reference | Comment |
Ttriple | 258.6 | K | N/A | Parks, Kennedy, et al., 1956, 2 | Uncertainty assigned by TRC = 0.2 K; TRC |
Ttriple | 253.5 | K | N/A | Miller, 1936, 2 | Uncertainty assigned by TRC = 0.3 K; TRC |
Quantity | Value | Units | Method | Reference | Comment |
ΔvapH° | 64.4 ± 1.7 | kJ/mol | V | Landrieu, Baylocq, et al., 1929 | Heat of formation derived by Cox and Pilcher, 1970; ALS |
ΔvapH° | 64.4 | kJ/mol | N/A | Landrieu, Baylocq, et al., 1929 | DRB |
Enthalpy of vaporization
ΔvapH (kJ/mol) | Temperature (K) | Method | Reference | Comment |
---|---|---|---|---|
53.6 | 319. | A | Stephenson and Malanowski, 1987 | Based on data from 304. to 443. K. See also Ketelaar, van Velden, et al., 2010.; AC |
Enthalpy of fusion
ΔfusH (kJ/mol) | Temperature (K) | Reference | Comment |
---|---|---|---|
13.1 | 258.6 | Domalski and Hearing, 1996 | AC |
13.129 | 258.6 | Parks, Kennedy, et al., 1956 | DH |
14.811 | 253.5 | Miller, 1935 | DH |
Entropy of fusion
ΔfusS (J/mol*K) | Temperature (K) | Reference | Comment |
---|---|---|---|
50.77 | 258.6 | Parks, Kennedy, et al., 1956 | DH |
58.4 | 253.5 | Miller, 1935 | DH |

Kovats' RI, non-polar column, isothermal

Column type | Active phase | Temperature (C) | I | Reference | Comment |
---|---|---|---|---|---|
Packed | SE-30 | 150. | 840. | Tiess, 1984 | Ar, Gas Chrom Q (80-100 mesh); Column length: 3. m |
Packed | DC-200 | 120. | 830. | Reymond, Mueggler-Chavan, et al., 1966 | Celite; Column length: 4. m |

Kovats' RI, non-polar column, temperature ramp

Column type | Active phase | I | Reference | Comment |
---|---|---|---|---|
Capillary | DB-1 | 827. | Takeoka, Perrino, et al., 1996 | 60. m/0.25 mm/0.25 μm, 30. C @ 4. min, 2. K/min; Tend: 220. C |
Capillary | DB-1 | 844. | Takeoka, Perrino, et al., 1996 | 60. m/0.25 mm/0.25 μm, 30. C @ 4. min, 2. K/min; Tend: 220. C |
Capillary | OV-101 | 856. | Shibamoto, Kamiya, et al., 1981 | N2, 1. K/min; Column length: 80. m; Column diameter: 0.28 mm; Tstart: 80. C; Tend: 200. C |
Capillary | OV-101 | 857. | Shibamoto, Kamiya, et al., 1981 | N2, 1. K/min; Column length: 80. m; Column diameter: 0.28 mm; Tstart: 80. C; Tend: 200. C |
Capillary | OV-101 | 857. | Yamaguchi and Shibamoto, 1979 | N2, 2. K/min; Column length: 70. m; Column diameter: 0.28 mm; Tstart: 80. C; Tend: 200. C |
Capillary | OV-101 | 858. | Yamaguchi and Shibamoto, 1979 | N2, 2. K/min; Column length: 70. m; Column diameter: 0.28 mm; Tstart: 80. C; Tend: 200. C |

Kovats' RI, polar column, temperature ramp

Column type | Active phase | I | Reference | Comment |
---|---|---|---|---|
Capillary | DB-Wax | 1666. | Shimoda and Shibamoto, 1990 | He, 40. C @ 6. min, 3. K/min; Column length: 60. m; Column diameter: 0.25 mm; Tend: 190. C |
Capillary | Carbowax 20M | 1623. | Nishimura, Yamaguchi, et al., 1989 | 2. K/min; Column length: 50. m; Column diameter: 0.22 mm; Tstart: 80. C; Tend: 200. C |
Capillary | Carbowax 20M | 1614. | Shibamoto, Kamiya, et al., 1981 | N2, 2. K/min; Column length: 50. m; Column diameter: 0.28 mm; Tstart: 80. C; Tend: 200. C |
Capillary | Carbowax 20M | 1617. | Shibamoto, Kamiya, et al., 1981 | N2, 2. K/min; Column length: 50. m; Column diameter: 0.28 mm; Tstart: 80. C; Tend: 200. C |
Capillary | Carbowax 20M | 1640. | Tressl, Friese, et al., 1978 | He, 2. K/min; Column length: 50. m; Column diameter: 0.28 mm; Tstart: 70. C; Tend: 190. C |

Van Den Dool and Kratz RI, non-polar column, temperature ramp

Column type | Active phase | I | Reference | Comment |
---|---|---|---|---|
Capillary | SPB-5 | 855. | Deport, Ratel, et al., 2006 | 60. m/0.32 mm/1. μm, He, 40. C @ 5. min, 3. K/min, 230. C @ 5. min |
Capillary | CP Sil 8 CB | 850. | Mahadevan and Farmer, 2006 | 60. C @ 5. min, 4. K/min, 220. C @ 30. min; Column length: 50. m; Column diameter: 0.32 mm |
Capillary | CP-Sil 8CB-MS | 856. | Hierro, de la Hoz, et al., 2004 | 60. m/0.25 mm/0.25 μm, 40. C @ 2. min, 4. K/min, 280. C @ 5. min |
Capillary | SPB-5 | 851. | Píno, Marbot, et al., 2004 | 30. m/0.25 mm/0.25 μm, He, 60. C @ 2. min, 4. K/min, 250. C @ 20. min |
Capillary | HP-5 | 852. | Siegmund and Murkovic, 2004 | 30. m/0.25 mm/0.1 μm, -30. C @ 1. min, 10. K/min, 250. C @ 5. min |
Capillary | CP Sil 5 CB | 819. | Pino, Almora, et al., 2003 | 60. m/0.32 mm/0.25 μm, He, 60. C @ 10. min, 3. K/min, 280. C @ 60. min |
Capillary | SPB-5 | 851. | Pino, Marbot, et al., 2003 | 30. m/0.25 mm/0.25 μm, He, 60. C @ 2. min, 4. K/min, 250. C @ 20. min |
Capillary | DB-1 | 826.1 | Sun and Stremple, 2003 | 30. m/0.25 mm/0.25 μm, He, 3. K/min; Tstart: 40. C; Tend: 325. C |
Capillary | BPX-5 | 880. | Bredie, Mottram, et al., 2002 | 50. m/0.32 mm/0.5 μm, 60. C @ 5. min, 4. K/min, 250. C @ 20. min |
Capillary | DB-5 | 813. | Karagül-Yüceer, Cadwallader, et al., 2002 | 30. m/0.32 mm/0.25 μm, 35. C @ 5. min, 10. K/min, 200. C @ 30. min |
Capillary | BPX-5 | 863. | Ames, Guy, et al., 2001 | 50. m/0.32 mm/0.5 μm, He, 60. C @ 5. min, 4. K/min, 250. C @ 10. min |
Capillary | BPX-5 | 876. | Ames, Guy, et al., 2001, 2 | 50. m/0.32 mm/0.25 μm, He, 60. C @ 5. min, 4. K/min, 250. C @ 10. min |
Capillary | BPX-5 | 880. | Ames, Guy, et al., 2001, 2 | 50. m/0.32 mm/0.25 μm, He, 60. C @ 5. min, 4. K/min, 250. C @ 10. min |
Capillary | DB-1 | 830. | Kim, 2001 | 60. m/0.32 mm/1. μm, He, 40. C @ 5. min, 2. K/min; Tend: 220. C |
Capillary | CP Sil 5 CB | 819. | Pino and Marbot, 2001 | 50. m/0.32 mm/0.4 μm, He, 60. C @ 10. min, 3. K/min, 280. C @ 60. min |
Capillary | CP Sil 8 CB | 856. | Elmore, Mottram, et al., 2000 | 60. m/0.25 mm/0.25 μm, He, 40. C @ 2. min, 4. K/min; Tend: 280. C |
Capillary | DB-1 | 830. | Wu, Wang, et al., 2000 | 60. m/0.25 mm/1. μm, N2, 5. K/min, 200. C @ 30. min; Tstart: 30. C |
Capillary | DB-5 | 865. | da Silva, Borba, et al., 1999 | 30. m/0.25 mm/0.25 μm, H2, 4. K/min; Tstart: 50. C; Tend: 290. C |
Capillary | DB-5 | 857. | Moio and Addeo, 1998 | 30. m/0.32 mm/1. μm, H2, 3. K/min; Tstart: 40. C; Tend: 210. C |
Capillary | DB-1 | 832. | Lee, DeMilo, et al., 1997 | 60. m/0.248 mm/0.25 μm, He, 5. K/min; Tstart: 50. C; Tend: 250. C |
Capillary | DB-1 | 833. | Lee, DeMilo, et al., 1997 | 60. m/0.248 mm/0.25 μm, He, 5. K/min; Tstart: 50. C; Tend: 250. C |
Capillary | DB-1 | 835. | Lee, DeMilo, et al., 1997 | 60. m/0.248 mm/0.25 μm, He, 5. K/min; Tstart: 50. C; Tend: 250. C |
Capillary | SPB-1 | 827. | Lee, DeMilo, et al., 1995 | 30. m/0.25 mm/0.25 μm, He, 50. C @ 5. min, 5. K/min; Tend: 250. C |
Capillary | DB-1 | 835. | Izzo and Ho, 1991 | 50. m/0.32 mm/1.05 μm, He, 2. K/min, 260. C @ 40. min; Tstart: 40. C |
Capillary | DB-1 | 835. | Zhang and Ho, 1991 | 60. m/0.25 mm/0.25 μm, He, 2. K/min, 220. C @ 10. min; Tstart: 40. C |
Capillary | OV-1 | 846. | Schreyen, Dirinck, et al., 1976 | N2, 1. K/min; Column length: 183. m; Tstart: 0. C; Tend: 230. C |

Van Den Dool and Kratz RI, non-polar column, custom temperature program

Column type | Active phase | I | Reference | Comment |
---|---|---|---|---|
Capillary | DB-5MS | 875. | Varlet, Serot, et al., 2007 | 30. m/0.32 mm/0.5 μm, He; Program: 70C => 5C/min => 85C(1min) => 3C/min => 165C => 10C/min => 280C(3min) |
Capillary | DB-5MS | 875. | Varlet V., Knockaert C., et al., 2006 | 30. m/0.32 mm/0.5 μm, He; Program: 70C(1min) => 3C/min => 80C(1min) => 5C/min => 150C => 10C/min => 280C (4min) |
Capillary | HP-5MS | 864. | Bonaiti, Irlinger, et al., 2005 | 30. m/0.25 mm/0.25 μm, He; Program: 5C(8min) => 3C/min => 20C => 10C/min => 150C(10min) |
Capillary | DB-5MS | 845. | Boulanger and Crouzet, 2001 | 30. m/0.25 mm/0.25 μm, H2; Program: 40C (5min) => 2C/min => 200C => 5C/min => 250C (15min) |
Capillary | CP Sil 8 CB | 891. | Duckham, Dodson, et al., 2001 | 60. m/0.25 mm/0.25 μm; Program: 0C => rapidly => 40C(8min) => 4C/min => 250C(10min) |
Capillary | CP-Sil 8CB-MS | 864. | Elmore, Mottram, et al., 2000, 2 | 60. m/0.25 mm/0.25 μm, He; Program: 0C(5min) => 40C/min => 40C (2min) => 4C/min => 280C |
Capillary | DB-5 | 864. | Parker, Hassell, et al., 2000 | 50. m/0.32 mm/0.5 μm, He; Program: oC(5min) => 60C/min => 60C (5min) => 4C/min => 250C |
Capillary | BPX-5 | 884. | Elmore, Mottram, et al., 1999 | 50. m/0.32 mm/0.5 μm, He; Program: 0C(5min) => 40C/min => 40C(2min) => 4C/min => 280C |
Capillary | BPX-5 | 868. | Bredie, Mottram, et al., 1998 | 50. m/0.32 mm/0.5 μm, He; Program: OC (5min) => 60C/min => 60C(5min) => 4C/min => 250C |
Capillary | DB-5 | 853. | Beal and Mottram, 1994 | 30. m/0.32 mm/1.0 μm, He; Program: 5 0C (0.5 min) -> (1 min) 60 0C (5 min) 4 0C/min -> 250 0C |
Capillary | HP-PONA | 823. | Maignial, Pibarot, et al., 1992 | 50. m/0.2 mm/0.5 μm; Program: 20C(0.5min) => fast => 60C => 4C/min => 250C |

Van Den Dool and Kratz RI, polar column, temperature ramp

Column type | Active phase | I | Reference | Comment |
---|---|---|---|---|
Capillary | DB-Wax | 1669. | Pozo-Bayon M.A., Ruiz-Rodriguez A., et al., 2007 | 30. m/0.25 mm/0.5 μm, He, 40. C @ 5. min, 4. K/min, 250. C @ 15. min |
Capillary | DB-Wax | 1665. | Cho, Choi, et al., 2006 | 60. m/0.25 mm/0.25 μm, He, 40. C @ 1. min, 4. K/min, 200. C @ 10. min |
Capillary | Innowax | 1660. | Lee, Lee, et al., 2006 | 60. m/0.25 mm/0.25 μm, He, 40. C @ 4. min, 4. K/min, 230. C @ 20. min |
Capillary | DB-Wax | 1667. | Lopez-Galilea I., Fournier N., et al., 2006 | 30. m/0.32 mm/0.5 μm, He, 5. K/min, 240. C @ 10. min; Tstart: 40. C |
Capillary | CP-Wax 52CB | 1658. | Mahadevan and Farmer, 2006 | 60. C @ 5. min, 4. K/min, 220. C @ 30. min; Column length: 50. m; Column diameter: 0.32 mm |
Capillary | OV-351 | 1631. | Bonvehí, 2005 | 50. m/0.32 mm/0.2 μm, He, 5. K/min; Tstart: 60. C; Tend: 220. C |
Capillary | Innowax | 1669. | Lee, Lee, et al., 2005 | 50. m/0.25 mm/0.25 μm, He, 50. C @ 3. min, 2. K/min, 220. C @ 20. min |
Capillary | Innowax | 1649. | Pena, Barciela, et al., 2005 | 30. m/0.25 mm/0.25 μm, He, 40. C @ 5. min, 5. K/min, 200. C @ 2. min |
Capillary | Carbowax 20M | 1656. | Verzera, Campisi, et al., 2005 | 60. m/0.25 mm/0.25 μm, He, 45. C @ 0.17 min, 2. K/min; Tend: 250. C |
Capillary | ZB-Wax | 1662. | Ledauphin, Saint-Clair, et al., 2004 | 30. m/0.25 mm/0.15 μm, He, 35. C @ 5. min, 5. K/min, 220. C @ 10. min |
Capillary | DB-Wax | 1613. | Mahajan, Goddik, et al., 2004 | 30. m/0.25 mm/0.5 μm, He, 40. C @ 2. min, 5. K/min, 230. C @ 10. min |
Capillary | AT-Wax | 1643. | Pino, Almora, et al., 2003 | 60. m/0.32 mm/0.25 μm, He, 65. C @ 10. min, 2. K/min, 250. C @ 60. min |
Capillary | Supelcowax-10 | 1665. | Chung, Yung, et al., 2002 | 60. m/0.25 mm/0.25 μm, He, 35. C @ 5. min, 2. K/min, 195. C @ 90. min |
Capillary | DB-Wax | 1635. | Karagül-Yüceer, Cadwallader, et al., 2002 | 30. m/0.25 mm/0.25 μm, 35. C @ 5. min, 10. K/min, 200. C @ 30. min |
Capillary | DB-FFAP | 1652. | Karagül-Yüceer, Cadwallader, et al., 2002 | 30. m/0.25 mm/0.25 μm, 35. C @ 5. min, 10. K/min, 200. C @ 30. min |
Capillary | Supelcowax-10 | 1665. | Chung, Yung, et al., 2001 | 60. m/0.25 mm/0.25 μm, He, 35. C @ 5. min, 2. K/min, 195. C @ 90. min |
Capillary | CP-Wax 52CB | 1693. | Liu, Yang, et al., 2001 | H2, 2. K/min; Column length: 50. m; Column diameter: 0.32 mm; Tstart: 50. C; Tend: 200. C |
Capillary | AT-Wax | 1650. | Pino and Marbot, 2001 | 60. m/0.32 mm/0.25 μm, He, 65. C @ 10. min, 2. K/min, 250. C @ 60. min |
Capillary | DB-Wax | 1655. | Shimoda, Yoshimura, et al., 2001 | 60. m/0.25 mm/0.25 μm, He, 2. K/min, 230. C @ 60. min; Tstart: 50. C |
Capillary | CP-Wax 52CB | 1656. | Verzera, Campisi, et al., 2001 | 60. m/0.25 mm/0.25 μm, He, 45. C @ 0.17 min, 2. K/min; Tend: 250. C |
Capillary | Supelcowax-10 | 1666. | Chung, 2000 | 60. m/0.25 mm/0.25 μm, He, 2. K/min, 195. C @ 90. min; Tstart: 35. C |
Capillary | Supelcowax-10 | 1666. | Chung, 1999 | 60. m/0.25 mm/0.25 μm, He, 35. C @ 5. min, 2. K/min, 195. C @ 90. min |
Capillary | DB-Wax | 1656. | Cha, Kim, et al., 1998 | 60. m/0.25 mm/0.25 μm, 40. C @ 5. min, 3. K/min, 200. C @ 60. min |
Capillary | DB-Wax | 1659. | Ott, Fay, et al., 1997 | 30. m/0.25 mm/0.25 μm, He, 20. C @ 5. min, 4. K/min, 200. C @ 10. min |
Capillary | PEG-20M | 1664. | Shimoda, Nakada, et al., 1997 | 60. m/0.25 mm/0.25 μm, He, 2. K/min, 230. C @ 60. min; Tstart: 50. C |
Capillary | DB-Wax | 1664. | Shimoda, Shiratsuchi, et al., 1996 | 60. m/0.25 mm/0.25 μm, He, 2. K/min, 230. C @ 60. min; Tstart: 50. C |
Capillary | DB-Wax | 1662. | Shimoda, Wu, et al., 1996 | 60. m/0.25 mm/0.25 μm, He, 3. K/min; Tstart: 50. C; Tend: 230. C |
Capillary | DB-Wax | 1667. | Shiratsuchi, Shimoda, et al., 1994 | 60. m/0.25 mm/0.25 μm, He, 2. K/min, 230. C @ 60. min; Tstart: 50. C |
Capillary | DB-Wax | 1659. | Shiratsuchi, Shimoda, et al., 1993 | 60. m/0.25 mm/0.25 μm, 50. C @ 4. min, 2. K/min, 230. C @ 30. min |
Capillary | DB-Wax | 1659. | Shiratsuchi, Shimoda, et al., 1993 | 60. m/0.25 mm/0.25 μm, 50. C @ 4. min, 2. K/min, 230. C @ 30. min |
Capillary | CP-WAX 57CB | 1651. | Baltes and Mevissen, 1988 | He, 50. C @ 5. min, 2. K/min; Column length: 50. m; Column diameter: 0.24 mm; Tend: 210. C |
Capillary | CP-WAX 57CB | 1665. | Salter L.J., Mottram D.S., et al., 1988 | 60. C @ 5. min, 4. K/min; Column length: 50. m; Column diameter: 0.32 mm; Tend: 200. C |

Van Den Dool and Kratz RI, polar column, custom temperature program

Column type | Active phase | I | Reference | Comment |
---|---|---|---|---|
Capillary | Supelcowax-10 | 1678. | Bianchi, Careri, et al., 2007 | 30. m/0.25 mm/0.25 μm, He; Program: 35C(8min) => 4C/min => 60C => 6C/min => 160C => 20C/min => 200C(1min) |
Capillary | Stabilwax | 1661. | Natali N., Chinnici F., et al., 2006 | 30. m/0.25 mm/0.25 μm, He; Program: 40C => 3C/min => 100C => 5C/min => 240C(10min) |
Capillary | FFAP | 1690. | Ranau, Kleeberg, et al., 2005 | 60. m/0.25 mm/0.5 μm, He; Program: 50C(3min) => 3C/min => 100C => 10C/min => 220C(13.5min) |
Capillary | FFAP | 1690. | Ranau and Steinhart, 2005 | 60. m/0.25 mm/0.5 μm, He; Program: 50C(3min) => 3C/min => 100C => 10C/min => 220C (13.5min) |
Capillary | DB-FFAP | 1665. | Huynh-Ba, Matthey-Doret, et al., 2003 | 30. m/0.32 mm/0.25 μm; Program: 35C(2min) => 6C/min => 180C => 10C/min => 240C (10min) |
Capillary | DB-Wax | 1620. | Boulanger and Crouzet, 2001 | 30. m/0.25 mm/0.25 μm, H2; Program: 60C (3min) => 2C/min => 220C => 5C/min => 250C (15min) |
Capillary | DB-Wax | 1698. | Radovic, Careri, et al., 2001 | 30. m/0.25 mm/0.25 μm; Program: 30C(8min) => 4C/min => 60C => 6C/min => 160C => 20C/min => 200C(1min) |
Capillary | BP-20 | 1692. | Beal and Mottram, 1994 | 50. m/0.32 mm/0.5 μm, He; Program: 5 0C (0.5 min) -> (1 min) 60 0C (5 min) 4 0C/min -> 200 0C |
Capillary | Supelcowax-10 | 1655. | Maignial, Pibarot, et al., 1992 | 60. m/0.25 mm/0.25 μm; Program: 20C(0.5min) => fast => 60C => 4C/min => 220C |
Capillary | Carbowax | 1651. | Baltes w. and Bochmann G., 1987 | Column diameter: 0.3 mm; Program: not specified |
Capillary | Carbowax | 1651. | Baltes w. and Bochmann G., 1987 | Column diameter: 0.3 mm; Program: not specified |
Capillary | Carbowax | 1651. | Baltes w. and Bochmann G., 1987 | Column diameter: 0.3 mm; Program: not specified |
Capillary | Carbowax | 1651. | Baltes w. and Bochmann G., 1987 | Column diameter: 0.3 mm; Program: not specified |
Capillary | Carbowax | 1651. | Baltes w. and Bochmann G., 1987 | Column diameter: 0.3 mm; Program: not specified |
Capillary | Carbowax | 1652. | Baltes w. and Bochmann G., 1987 | Column diameter: 0.3 mm; Program: not specified |

Normal alkane RI, non-polar column, temperature ramp

Column type | Active phase | I | Reference | Comment |
---|---|---|---|---|
Capillary | HP-5 MS | 866. | Wanakhachornkrai and Lertsiri, 9999 | 30. m/0.25 mm/0.25 μm, Helium, 15. K/min; Tstart: 45. C; Tend: 280. C |
Capillary | DB-5 | 844. | Cais-Sokolinska, Majcher, et al., 2011 | 25. m/0.20 mm/0.33 μm, Helium, 50. C @ 1. min, 20. K/min; Tend: 240. C |
Capillary | VF-5 MS | 855. | Leffingwell and Alford, 2011 | 60. m/0.32 mm/0.25 μm, Helium, 2. K/min, 260. C @ 28. min; Tstart: 30. C |
Capillary | VF-5 MS | 861. | Leffingwell and Alford, 2011 | 60. m/0.32 mm/0.25 μm, Helium, 2. K/min, 260. C @ 28. min; Tstart: 30. C |
Capillary | VF-5 MS | 867. | Liu, Lu, et al., 2011 | 30. m/0.25 mm/0.25 μm, Helium, 40. C @ 3. min, 5. K/min, 250. C @ 3. min |
Capillary | HP-5 MS | 845. | Radulovic, Dordevic, et al., 2010 | 30. m/0.25 mm/0.25 μm, Helium, 5. K/min, 290. C @ 10. min; Tstart: 70. C |
Capillary | DB-5 MS | 857. | Chen, Song, et al., 2009 | 30. m/0.32 mm/0.25 μm, Helium, 40. C @ 2. min, 6. K/min, 230. C @ 20. min |
Capillary | DB-5 MS | 850. | Chen, Song, et al., 2009 | 30. m/0.32 mm/0.25 μm, Helium, 40. C @ 2. min, 6. K/min, 250. C @ 20. min |
Capillary | HP-5 MS | 853. | Kim and Chung, 2009 | 30. m/0.25 mm/0.25 μm, Helium, 35. C @ 5. min, 2. K/min, 195. C @ 30. min |
Capillary | RTX-5 | 884. | Pham, Schilling, et al., 2008 | 30. m/0.25 mm/0.25 μm, He, 40. C @ 5. min, 20. K/min; Tend: 250. C |
Capillary | Elite-5MS | 852. | Tava, Pecetti, et al., 2007 | 30. m/0.32 mm/0.5 μm, He, 40. C @ 5. min, 4. K/min, 280. C @ 10. min |
Capillary | DB-5 | 864. | Fadel, Mageed, et al., 2006 | He, 60. C @ 5. min, 4. K/min; Column length: 60. m; Column diameter: 0.32 mm; Tend: 250. C |
Capillary | DB-5 | 864. | Fadel, Mageed, et al., 2006, 2 | He, 50. C @ 5. min, 4. K/min; Column length: 60. m; Column diameter: 0.32 mm; Tend: 250. C |
Capillary | DB-5 | 854. | Fan and Qian, 2006 | 30. m/0.32 mm/1. μm, He, 40. C @ 2. min, 4. K/min, 250. C @ 15. min |
Capillary | HP-5MS | 857. | Kim, Abd El-Aty, et al., 2006 | 30. m/0.25 mm/0.25 μm, He, 50. C @ 4. min, 5. K/min, 280. C @ 10. min |
Capillary | SPB-5 | 854. | Pino, Marquez, et al., 2006 | 30. m/0.25 mm/0.25 μm, Helium, 60. C @ 2. min, 4. K/min, 250. C @ 20. min |
Capillary | HP-1 | 832. | Valette, Fernandez, et al., 2006 | 50. m/0.2 mm/0.5 μm, He, 2. K/min, 250. C @ 40. min; Tstart: 60. C |
Capillary | HP-5 | 865.9 | Leffingwell and Alford, 2005 | 60. m/0.32 mm/0.25 μm, He, 30. C @ 2. min, 2. K/min, 260. C @ 28. min |
Capillary | DB-1 | 827. | Park, Lee, et al., 2004 | 60. m/0.32 mm/0.25 μm, He, 35. C @ 4. min, 2. K/min, 230. C @ 25. min |
Capillary | DB-1 | 827. | Park, Lee, et al., 2004 | 60. m/0.32 mm/0.25 μm, He, 35. C @ 4. min, 2. K/min, 230. C @ 25. min |
Capillary | DB-1 | 827. | Park, Lee, et al., 2004 | 60. m/0.32 mm/0.25 μm, He, 35. C @ 4. min, 2. K/min, 230. C @ 25. min |
Capillary | DB-1 | 829. | Park, Lee, et al., 2004 | 60. m/0.32 mm/0.25 μm, He, 35. C @ 4. min, 2. K/min, 230. C @ 25. min |
Capillary | HP-5 | 866. | Wanakhachornkrai and Lertsiri, 2003 | 30. m/0.25 mm/0.25 μm, He, 45. C @ 2. min, 15. K/min, 280. C @ 11.4 min |
Capillary | SPB-5 | 853. | Poligné, Collignan, et al., 2001 | 60. m/0.32 mm/1. μm, He, 3. K/min; Tstart: 40. C; Tend: 200. C |
Capillary | BP-1 | 830. | Health Safety Executive, 2000 | 50. m/0.22 mm/0.75 μm, He, 5. K/min; Tstart: 50. C; Tend: 200. C |
Capillary | DB-1 | 839. | Chen and Ho, 1999 | 60. m/0.32 mm/1. μm, He, 2. K/min; Tstart: 40. C; Tend: 260. C |
Capillary | DB-1 | 842. | Chen and Ho, 1998 | 60. m/0.32 mm/1.0 μm, He, 2. K/min; Tstart: 40. C; Tend: 260. C |
Capillary | DB-1 | 835. | Tai and Ho, 1998 | 60. m/0.32 mm/1.0 μm, He, 2. K/min; Tstart: 40. C; Tend: 280. C |
Capillary | DB-1 | 827. | Buttery, Ling, et al., 1997 | 30. C @ 25. min, 4. K/min, 200. C @ 20. min; Column length: 60. m; Column diameter: 0.25 mm |
Capillary | DB-1 | 827. | Buttery and Ling, 1995 | He, 30. C @ 25. min, 4. K/min, 200. C @ 20. min; Column length: 60. m; Column diameter: 0.25 mm |
Capillary | DB-1 | 849. | Yu and Ho, 1995 | 60. m/0.25 mm/1. μm, He, 40. C @ 5. min, 2. K/min, 260. C @ 60. min |
Capillary | DB-1 | 827. | Buttery, Stern, et al., 1994 | He, 30. C @ 25. min, 4. K/min, 200. C @ 20. min; Column length: 60. m; Column diameter: 0.32 mm |
Capillary | DB-1 | 823. | Yu, Wu, et al., 1994 | 60. m/0.25 mm/1.0 μm, He, 40. C @ 5. min, 2. K/min, 260. C @ 60. min |
Capillary | DB-1 | 865. | Nishibori and Bernhard, 1993 | 30. m/0.25 mm/0.25 μm, He, 50. C @ 8. min, 4. K/min; Tend: 250. C |
Capillary | DB-5 | 863. | Lee, Macku, et al., 1991 | 60. m/0.25 mm/0.25 μm, 40. C @ 5. min, 2. K/min; Tend: 250. C |
Capillary | DB-1 | 825. | Flath, Matsumoto, et al., 1989 | 60. m/0.32 mm/0.25 μm, 4. K/min; Tstart: 50. C; Tend: 250. C |
Capillary | DB-1 | 825. | Flath, Matsumoto, et al., 1989 | 60. m/0.32 mm/0.25 μm, 4. K/min; Tstart: 50. C; Tend: 250. C |
Capillary | DB-1 | 826. | Flath, Matsumoto, et al., 1989 | 60. m/0.32 mm/0.25 μm, 4. K/min; Tstart: 50. C; Tend: 250. C |
Capillary | DB-1 | 829. | Flath, Matsumoto, et al., 1989 | 60. m/0.32 mm/0.25 μm, 4. K/min; Tstart: 50. C; Tend: 250. C |
Capillary | OV-101 | 826. | Sugisawa, Yang, et al., 1989 | N2, 2. K/min; Column length: 50. m; Column diameter: 0.25 mm; Tstart: 80. C; Tend: 200. C |
Capillary | OV-101 | 827. | Sugisawa, Yang, et al., 1989 | N2, 2. K/min; Column length: 50. m; Column diameter: 0.25 mm; Tstart: 80. C; Tend: 200. C |
Capillary | DB-1 | 826. | Engel, Flath, et al., 1988 | 60. m/0.315 mm/0.25 μm, He, 4. K/min; Tstart: 50. C; Tend: 250. C |
Capillary | DB-5 | 874. | Georgilopoulos and Gallois, 1988 | 30. m/0.35 mm/1.0 μm, Hydrogen, 2. K/min; Tstart: 45. C; Tend: 220. C |

Normal alkane RI, non-polar column, custom temperature program

Column type | Active phase | I | Reference | Comment |
---|---|---|---|---|
Capillary | SLB-5 MS | 860. | Mondello, 2012 | 30. m/0.25 mm/0.25 μm, Helium; Program: not specified |
Capillary | SLB-5 MS | 864. | Mondello, 2012 | 30. m/0.25 mm/0.25 μm, Helium; Program: not specified |
Capillary | Polydimethyl siloxane with 5 % Ph groups | 862. | Robinson, Adams, et al., 2012 | Program: not specified |
Capillary | Polydimethyl siloxane with 5 % Ph groups | 866. | Robinson, Adams, et al., 2012 | Program: not specified |
Capillary | HP-5 MS | 848. | Rodrigues, Hanson, et al., 2012 | 30. m/0.32 mm/0.25 μm, Helium; Program: 40 0C (1 min) 3 0C/min -> 150 0C (15 min) 5 0C/min -> 250 0C (5 min) |
Capillary | HP-5 MS | 848. | Grzeszczuk, Wesolowska, et al., 2011 | 30. m/0.25 mm/0.25 μm, Helium; Program: 40 0C (5 min) 30 0C/min -> 60 0C 6 0C/min -> 230 0C (10 min) |
Capillary | VF-5 MS | 864. | Liu, Lu, et al., 2011 | 30. m/0.25 mm/0.25 μm, Helium; Program: not specified |
Capillary | Polydimethyl siloxane | 850. | Xu, He, et al., 2010 | Program: 40 0C 20 0C/min -> 60 0C (5 min) 4 0C/min -> 250 0C |
Capillary | DB-5 | 858. | Yu and Zhang, 2010 | 30. m/0.25 mm/0.25 μm; Program: 40 0C (5 min) 5 0C/min -> 260 0C 15 0C/min -> 280 0C (1 min) |
Capillary | RTX-5 MS | 882. | Mebazaa, Mahmoudi, et al., 2009 | 30. m/0.25 mm/0.25 μm, Helium; Program: 50 0C (5 min) 2 0C/min -> 100 0C (5 min) 5 0C/min -> 300 0C |
Capillary | ZB-5 | 857. | de Simon, Estruelas, et al., 2009 | 30. m/0.25 mm/0.25 μm, Helium; Program: 45 0C 3 0C/min -> 230 0C (10 min) 10 0C/min -> 270 0C (21 min) |
Capillary | SLB-5MS | 860. | Risticevic, Carasek, et al., 2008 | 10. m/0.18 mm/0.18 μm, Helium; Program: not specified |
Capillary | HP-5 MS | 860. | Wan Aida, Ho, et al., 2008 | 30. m/0.25 mm/0.25 μm, Helium; Program: 50 0C (2 min) 20 0C/min -> 80 0C (1 min) 20 0C -> 100 0C (1 min) 30 0C/min -> 230 0C (2 min) |
Capillary | HP-5 MS | 853. | Xie, Sun, et al., 2008 | 30. m/0.25 mm/0.25 μm, Helium; Program: 40 0C (2 min) 4 0C/min -> 220 0C 20 0C/min -> 280 0C |
Capillary | HP-5 MS | 856. | Xie, Sun, et al., 2008 | 30. m/0.25 mm/0.25 μm, Helium; Program: 40 0C (2 min) 4 0C/min -> 220 0C 20 0C/min -> 280 0C |
Capillary | DB-5 MS | 853. | Cajka, Hajslova, et al., 2007 | 30. m/0.25 mm/0.25 μm, Helium; Program: 45 0C (0.75 min) 10 0C/min -> 200 0C 30 0C/min -> 245 0C (1.25 min) |
Capillary | HP-5MS | 860. | Ho, Wan Aida, et al., 2007 | 30. m/0.25 mm/0.25 μm, He; Program: 50C(2min) => 20C/min => 80C (1min) => 20C/min => 100C(1min) => 30C/min => 230C(3min) |
Capillary | DB-5 MS | 853. | Liu, Xu, et al., 2007 | 60. m/0.32 mm/1.0 μm, Helium; Program: 40 0C (2 min) 6 0C/min -> 100 0C 4 0C/min -> 180 0C 8 0C/min -> 250 0C (12 min) |
Capillary | HP-5 | 858. | Garcia-Estaban, Ansorena, et al., 2004 | 50. m/0.32 mm/1.05 μm; Program: 40C(10min) => 5C/min => 200C => 20C/min => 250C(5min) |
Capillary | SE-30 | 834. | Vinogradov, 2004 | Program: not specified |
Capillary | CP Sil 5 CB | 827. | Counet, Callemien, et al., 2002 | 50. m/0.32 mm/1.2 μm; Program: 36C => 20C/min => 85C => 1C/min => 145C=3C/min => 250C(30min) |
Capillary | CP Sil 5 CB | 827. | Counet, Callemien, et al., 2002 | 50. m/0.32 mm/1.2 μm; Program: 36C => 20C/min => 85C => 1C/min => 145C=3C/min => 250C(30min) |
Capillary | CP Sil 5 CB | 824. | Guyot-Declerck, Renson, et al., 2002 | 50. m/0.32 mm/1.2 μm, He; Program: 36C => 20C/min => 85C => 1C/min => 145C => 3C/min => 250C |
Capillary | Methyl phenyl siloxane (not specified) | 852. | Poligne, Collignan, et al., 2002 | Program: not specified |
Capillary | HP-5MS | 853. | Ansorena, Gimeno, et al., 2001 | 30. m/0.25 mm/0.25 μm, He; Program: 40C (10min) => 3C/min => 120C => 10C/min => 250C (5min) |
Capillary | CP Sil 8 CB | 867. | Duckham, Dodson, et al., 2001 | 60. m/0.25 mm/0.25 μm; Program: not specified |
Capillary | HP-5 | 850. | Ansorena, Astiasarán, et al., 2000 | 30. m/0.25 mm/0.25 μm, He; Program: 40C (10min) => 3C/min => 120C => 10C/min => 250C (5min) |
Capillary | CP Sil 5 CB | 825. | Guyot, Scheirman, et al., 1999 | He; Column length: 50. m; Column diameter: 0.32 mm; Program: 30C => 55C/min => 85C => 1C/min => 145C => 3C/min => 250C |
Capillary | CP Sil 5 CB | 823. | Guyot, Bouseta, et al., 1998 | 50. m/0.32 mm/1.2 μm, He; Program: 30C => 55C/min => 85C => 1C/min => 145C => 3C/min => 250C |
Capillary | DB-5 | 863. | Mateo, Aguirrezábal, et al., 1997 | 50. m/0.32 mm/0.25 μm, He; Program: 40C(10min) => 3C/min => 95C => 10C/min => 270C(10min) |
Capillary | DB-5 | 875. | Mateo and Zumalacárregui, 1996 | 50. m/0.32 mm/0.25 μm, He; Program: 40C (10min) => 3C/min => 95C => 10C/min => 270C (10min) |
Capillary | DB-5 | 881. | Mateo and Zumalacárregui, 1996 | 50. m/0.32 mm/0.25 μm, He; Program: 40C (10min) => 3C/min => 95C => 10C/min => 270C (10min) |
Capillary | RSL-150 | 812. | Buchbauer, Nikiforov, et al., 1994 | 60. m/0.32 mm/0.25 μm, He; Program: 30c (1.5min) => 20C/min => 55C => 6C/min => 200C(10min) |
Capillary | DB-1 | 830. | Kawai, Ishida, et al., 1991 | 60. m/0.25 mm/0.25 μm; Program: not specified |
Capillary | DB-1 | 832. | Kawai, Ishida, et al., 1991 | 60. m/0.25 mm/0.25 μm; Program: not specified |
Capillary | OV-1, SE-30, Methyl silicone, SP-2100, OV-101, DB-1, etc. | 856. | Waggott and Davies, 1984 | Hydrogen; Column length: 50. m; Column diameter: 0.32 mm; Program: not specified |

Normal alkane RI, polar column, temperature ramp

Column type | Active phase | I | Reference | Comment |
---|---|---|---|---|
Capillary | HP-FFAP | 1685. | Wanakhachornkrai and Lertsiri, 9999 | 25. m/0.32 mm/0.50 μm, Helium, 15. K/min; Tstart: 45. C; Tend: 220. C |
Capillary | HP-FFAP | 1687. | Wanakhachornkrai and Lertsiri, 9999 | 25. m/0.32 mm/0.50 μm, Helium, 15. K/min; Tstart: 45. C; Tend: 220. C |
Capillary | HP-Innowax | 1671. | Puvipirom and Chaisei, 2012 | 15. m/0.32 mm/0.50 μm, Helium, 3. K/min; Tstart: 40. C; Tend: 250. C |
Capillary | FFAP | 1694. | Budryn, Nebesny, et al., 2011 | 30. m/0.32 mm/0.50 μm, Nitrogen, 35. C @ 5. min, 4. K/min, 250. C @ 45. min |
Capillary | DB-Wax | 1626. | Moon and Shibamoto, 2010 | 60. m/0.25 mm/0.50 μm, Helium, 40. C @ 5. min, 2. K/min, 210. C @ 70. min |
Capillary | DB-Wax | 1667. | Chen, Song, et al., 2009 | 30. m/0.32 mm/0.25 μm, Helium, 40. C @ 2. min, 6. K/min, 230. C @ 20. min |
Capillary | DB-Wax | 1670. | Chen, Song, et al., 2009 | 30. m/0.32 mm/0.25 μm, Helium, 40. C @ 2. min, 6. K/min, 230. C @ 20. min |
Capillary | CP-Wax | 1647. | Mo, Fan, et al., 2009 | 60. m/0.25 mm/0.25 μm, Helium, 50. C @ 2. min, 6. K/min, 230. C @ 15. min |
Capillary | DB-Wax | 1678. | Moon and Shibamoto, 2009 | 60. m/0.25 mm/0.50 μm, Helium, 40. C @ 5. min, 2. K/min, 210. C @ 70. min |
Capillary | CP-Wax 57 CB | 1664. | Callejon, Morales, et al., 2008 | 50. m/0.25 mm/0.20 μm, Hydrogen, 35. C @ 5. min, 4. K/min, 150. C @ 17.5 min |
Capillary | Innowax | 1671. | Kaypak and Avsar, 2008 | 30. m/0.25 mm/0.25 μm, 40. C @ 5. min, 10. K/min, 200. C @ 15. min |
Capillary | ZB-Wax | 1689. | Marin, Pozrl, et al., 2008 | 60. m/0.32 mm/0.50 μm, Helium, 40. C @ 5. min, 4. K/min, 220. C @ 5. min |
Capillary | HP-Innowax | 1670. | Soria, Sanz, et al., 2008 | 50. m/0.20 mm/0.20 μm, Helium, 45. C @ 2. min, 4. K/min, 190. C @ 50. min |
Capillary | FFAP | 1694. | Nebesny, Budryn, et al., 2007 | 30. m/0.32 mm/0.5 μm, N2, 35. C @ 5. min, 4. K/min, 320. C @ 45. min |
Capillary | RTX-Wax | 1646. | Prososki, Etzel, et al., 2007 | 30. m/0.25 mm/0.5 μm, He, 40. C @ 5. min, 10. K/min, 220. C @ 10. min |
Capillary | DB-Wax | 1647. | Fan and Qian, 2006 | 30. m/0.32 mm/0.25 μm, He, 40. C @ 2. min, 4. K/min, 230. C @ 15. min |
Capillary | DB-Wax | 1647. | Fan and Qian, 2006 | 30. m/0.32 mm/0.25 μm, He, 40. C @ 2. min, 4. K/min, 230. C @ 15. min |
Capillary | DB-Wax | 1619. | Fujioka and Shibamoto, 2006 | 60. m/0.25 mm/0.25 μm, He, 2. K/min, 200. C @ 90. min; Tstart: 50. C |
Capillary | DB-Wax | 1666. | Osada and Shibamoto, 2006 | He, 60. C @ 5. min, 2. K/min, 180. C @ 30. min; Column length: 30. m; Column diameter: 0.25 mm |
Capillary | Carbowax 20M | 1659. | de la Fuente, Martinez-Castro, et al., 2005 | 50. m/0.25 mm/0.25 μm, Helium, 40. C @ 2. min, 4. K/min, 190. C @ 30. min |
Capillary | CP-Wax | 1657. | Ka, Choi, et al., 2005 | 30. m/0.32 mm/0.25 μm, He, 40. C @ 2. min, 5. K/min; Tend: 180. C |
Capillary | TC-Wax | 1659. | Ishikawa, Ito, et al., 2004 | 60. m/0.25 mm/0.5 μm, He, 40. C @ 8. min, 3. K/min; Tend: 230. C |
Capillary | HP-Innowax | 1675. | Soria, Gonzalez, et al., 2004 | 50. m/0.2 mm/0.2 μm, He, 45. C @ 2. min, 4. K/min, 190. C @ 50. min |
Capillary | DB-Wax | 1669. | Yanagimoto, Ochi, et al., 2004 | 30. m/0.25 mm/0.25 μm, He, 3. K/min, 180. C @ 40. min; Tstart: 50. C |
Capillary | DB-Wax | 1660. | Lee and Noble, 2003 | 30. m/0.25 mm/0.25 μm, He, 40. C @ 4. min, 4. K/min, 185. C @ 20. min |
Capillary | DB-Wax | 1661. | Lin, Cai, et al., 2003 | 30. m/0.25 mm/0.25 μm, He, 50. C @ 2. min, 3. K/min, 230. C @ 20. min |
Capillary | HP-Innowax | 1673. | Soria, Martinez-Castro, et al., 2003 | 50. m/0.2 mm/0.2 μm, He, 45. C @ 2. min, 4. K/min, 190. C @ 50. min |
Capillary | Carbowax 20M | 1673. | Soria, Martinez-Castro, et al., 2003 | 50. m/0.25 mm/0.25 μm, He, 45. C @ 2. min, 4. K/min, 190. C @ 50. min |
Capillary | DB-Wax | 1664. | Tanaka, Yamauchi, et al., 2003 | 30. m/0.25 mm/0.25 μm, 30. C @ 1. min, 4. K/min; Tend: 250. C |
Capillary | DB-Wax | 1665. | Tanaka, Yamauchi, et al., 2003 | 30. m/0.25 mm/0.25 μm, 30. C @ 1. min, 4. K/min; Tend: 250. C |
Capillary | HP-FFAP | 1687. | Wanakhachornkrai and Lertsiri, 2003 | 25. m/0.32 mm/0.5 μm, He, 15. K/min; Tstart: 45. C; Tend: 220. C |
Capillary | HP-FFAP | 1687. | Wanakhachornkrai and Lertsiri, 2003 | 25. m/0.32 mm/0.5 μm, He, 15. K/min; Tstart: 45. C; Tend: 220. C |
Capillary | HP-FFAP | 1685. | Wanakhachornkrai and Lertsiri, 2003 | 25. m/0.32 mm/0.5 μm, He, 15. K/min; Tstart: 45. C; Tend: 220. C |
Capillary | DB-Wax | 1640. | Fu, Yoon, et al., 2002 | 30. m/0.25 mm/0.25 μm, He, 40. C @ 5. min, 8. K/min, 250. C @ 5. min |
Capillary | TC-WAX FFS | 1648. | Miyazawa, Maehara, et al., 2002 | He, 3. K/min; Column length: 60. m; Column diameter: 0.25 mm; Tstart: 60. C; Tend: 240. C |
Capillary | HP-FFAP | 1616. | Qian and Reineccius, 2002 | 25. m/0.32 mm/0.52 μm, 60. C @ 1. min, 5. K/min, 240. C @ 5. min |
Capillary | HP-FFAP | 1616. | Qian and Reineccius, 2002 | 25. m/0.32 mm/0.52 μm, 60. C @ 1. min, 5. K/min, 240. C @ 5. min |
Capillary | HP-FFAP | 1616. | Qian and Reineccius, 2002 | 25. m/0.32 mm/0.52 μm, 60. C @ 1. min, 5. K/min, 240. C @ 5. min |
Capillary | HP-Wax | 1686. | Sanz, Maeztu, et al., 2002 | 60. m/0.25 mm/0.5 μm, He, 40. C @ 6. min, 3. K/min; Tend: 190. C |
Capillary | HP-Wax | 1686. | Maeztu, Sanz, et al., 2001 | 60. m/0.25 mm/0.5 μm, He, 40. C @ 6. min, 3. K/min; Tend: 190. C |
Capillary | HP-Wax | 1686. | Sanz, Ansorena, et al., 2001 | 60. m/0.25 mm/0.5 μm, He, 40. C @ 6. min, 3. K/min; Tend: 190. C |
Capillary | DB-Wax | 1650. | Wei, Mura, et al., 2001 | 60. m/0.25 mm/0.25 μm, He, 2. K/min; Tstart: 40. C; Tend: 200. C |
Capillary | DB-Wax | 1656. | Buttery, Orts, et al., 1999 | 30. C @ 4. min, 2. K/min, 170. C @ 60. min; Column length: 60. m; Column diameter: 0.32 mm |
Capillary | DB-Wax | 1659. | Umano, Nakahara, et al., 1999 | 60. m/0.25 mm/0.25 μm, He, 40. C @ 2. min, 2. K/min; Tend: 200. C |
Capillary | DB-Wax | 1656. | Buttery and Ling, 1998 | 30. C @ 4. min, 2. K/min, 170. C @ 30. min; Column length: 60. m; Column diameter: 0.25 mm |
Capillary | DB-Wax | 1686. | Mölleken, Sinnwell, et al., 1998 | 30. m/0.25 mm/0.25 μm, N2, 3. K/min; Tstart: 45. C; Tend: 220. C |
Capillary | CP-Wax 52CB | 1666. | Chyau, Lin, et al., 1997 | 50. m/0.32 mm/0.25 μm, He, 50. C @ 5. min, 1.5 K/min, 210. C @ 10. min |
Capillary | DB-Wax | 1660. | Sekiwa, Kubota, et al., 1997 | He, 2. K/min; Column length: 60. m; Column diameter: 0.25 mm; Tstart: 60. C; Tend: 180. C |
Capillary | PEG-20M | 1623. | Kubota, Matsujage, et al., 1996 | 50. m/0.25 mm/0.25 μm, Nitrogen, 2. K/min; Tstart: 60. C; Tend: 180. C |
Capillary | DB-Wax | 1647. | Pollak and Berger, 1996 | 30. m/0.32 mm/0.5 μm, He, 40. C @ 1. min, 3. K/min, 210. C @ 25. min |
Capillary | TC-Wax | 1663. | Shuichi, Masazumi, et al., 1996 | 80. C @ 5. min, 3. K/min; Column length: 60. m; Column diameter: 0.25 mm; Tend: 240. C |
Capillary | DB-Wax | 1663. | Umano, Hagi, et al., 1995 | He, 40. C @ 2. min, 2. K/min; Column length: 60. m; Column diameter: 0.25 mm; Tend: 200. C |
Capillary | DB-Wax | 1659. | Shimoda, Shiratsuchi, et al., 1993 | 60. m/0.25 mm/0.25 μm, He, 50. C @ 4. min, 2. K/min; Tend: 230. C |
Capillary | DB-Wax | 1659. | Shimoda, Shiratsuchi, et al., 1993 | 60. m/0.25 mm/0.25 μm, He, 50. C @ 4. min, 2. K/min; Tend: 230. C |
Capillary | DB-Wax | 1638. | Hatsuko, Kazuko, et al., 1992 | He, 60. C @ 10. min, 3. K/min; Column length: 30. m; Column diameter: 0.25 mm; Tend: 240. C |
Capillary | Carbowax 20M | 1660. | Vernin, Metzger, et al., 1992 | He, 3. K/min; Column length: 50. m; Column diameter: 0.33 mm; Tstart: 60. C; Tend: 200. C |
Capillary | Carbowax 20M | 1626. | Kawakami and Kobayashi, 1991 | He, 60. C @ 4. min, 2. K/min; Column length: 50. m; Column diameter: 0.25 mm; Tend: 180. C |
Capillary | DB-Wax | 1622. | Pfannhauser, 1990 | 30, 30. C @ 10. min, 50. K/min; Column diameter: 0.25 mm; Tend: 240. C |
Capillary | DB-Wax | 1653. | Engel, Flath, et al., 1988 | 60. m/0.322 mm/0.25 μm, He, 4. K/min; Tstart: 50. C; Tend: 230. C |
Capillary | FFAP | 1650. | Vernin, Metzger, et al., 1988 | He, 60. C @ 5. min, 2. K/min; Column length: 50. m; Column diameter: 0.28 mm; Tend: 240. C |
Capillary | FFAP | 1650. | Vernin, Metzger, et al., 1988 | He, 60. C @ 5. min, 2. K/min; Column length: 50. m; Column diameter: 0.28 mm; Tend: 240. C |
Capillary | DB-Wax | 1661. | Wong and Bernhard, 1988 | He, 70. C @ 8. min, 2. K/min; Column length: 30. m; Column diameter: 0.25 mm; Tend: 160. C |
Capillary | Carbowax 20M | 1650. | Buttery, Ling, et al., 1983 | 50. C @ 30. min, 1. K/min, 170. C @ 60. min; Column length: 150. m; Column diameter: 0.64 mm |
Capillary | Carbowax 20M | 1625. | Shibamoto and Russell, 1977 | 1. K/min; Column length: 100. m; Column diameter: 0.25 mm; Tstart: 70. C; Tend: 170. C |
Capillary | Carbowax 20M | 1630. | Shibamoto and Russell, 1977 | 1. K/min; Column length: 100. m; Column diameter: 0.25 mm; Tstart: 70. C; Tend: 170. C |

Normal alkane RI, polar column, custom temperature program

Column type | Active phase | I | Reference | Comment |
---|---|---|---|---|
Capillary | DB-Wax | 1658. | Gyawali and Kim, 2012 | 60. m/0.20 mm/0.25 μm, Helium; Program: 40 0C (3 min) 2 0C/min -> 150 0C 4 0C/min -> 220 0C (20 min) 5 0C/min -> 230 0C |
Capillary | DB-Wax | 1661. | Welke, Manfroi, et al., 2012 | 30. m/0.25 mm/0.25 μm, Helium; Program: not specified |
Capillary | DB-Wax | 1680. | Welke, Manfroi, et al., 2012 | 30. m/0.25 mm/0.25 μm, Helium; Program: not specified |
Capillary | HP-Innowax | 1678. | Xiao, Dai, et al., 2011 | 60. m/0.25 mm/0.25 μm, Helium; Program: 40 0C (2 min) 3 0C/min -> 150 0C 5 0C/min -> 220 0C (5 min) |
Capillary | Stabilwax | 1661. | Chinnici, Guerrero, et al., 2009 | 30. m/0.25 mm/0.25 μm, Helium; Program: 35 0C 3 0C/min -> 100 0C 5 0C/min -> 240 0C (10 min) |
Capillary | DB-FFAP | 1632. | Mebazaa, Mahmoudi, et al., 2009 | 30. m/0.25 mm/0.25 μm, Helium; Program: 50 0C 2 0C/min -> 100 0C (5 min) 5 0C/min -> 250 0C |
Capillary | DB-FFAP | 1661. | Mebazaa, Mahmoudi, et al., 2009 | 30. m/0.25 mm/0.25 μm, Helium; Program: not specified |
Capillary | Supelcowax-10 | 1647. | de Simon, Estruelas, et al., 2009 | 30. m/0.25 mm/0.25 μm, Helium; Program: 45 0C 3 0C/min -> 230 0C (10 min) 10 0C/min -> 270 0C (21 min) |
Capillary | Supelcowax 10 | 1662. | Soria, Martinez-Castro, et al., 2008 | 50. m/0.25 mm/0.25 μm, Helium; Program: 45 0C (15 min) 3 0C/min -> 75 0C 5 0C/min -> 180 0C (10 min) |
Capillary | DB-Wax | 1647. | Tao, Wenlai, et al., 2008 | 30. m/0.32 mm/0.25 μm, Helium; Program: 50 0C 20 0C/min -> 80 0C 3 0C/min -> 230 0C |
Capillary | DB-Wax | 1668. | Gonzalez-Rios, Suarez-Quiroz, et al., 2007 | 30. m/0.25 mm/0.25 μm, Hydrogen; Program: 44 0C 3 0C/min -> 170 0C 8 0C/min -> 250 0C |
Capillary | DB-Wax | 1686. | Gonzalez-Rios, Suarez-Quiroz, et al., 2007 | 30. m/0.25 mm/0.25 μm, Hydrogen; Program: not specified |
Capillary | BP-20 | 1660. | Pontes, Marques, et al., 2007 | 30. m/0.25 mm/0.25 μm, He; Program: 50C(1min) => 2.5C/min => 100C => 2C/min => 180C => 15C/min => 220C |
Capillary | BP-20 | 1663. | Pontes, Marques, et al., 2007 | 30. m/0.25 mm/0.25 μm, He; Program: 50C(1min) => 2.5C/min => 100C => 2C/min => 180C => 15C/min => 220C |
Capillary | HP-Innowax | 1669. | Viegas and Bassoli, 2007 | 60. m/0.32 mm/0.25 μm, Helium; Program: 40 0C (5 min) 4 0C/min -> 60 0C (5 min) 8 0C/min -> 250 0C (3 min) |
Capillary | HP-Innowax | 1667. | Viegas and Bassoli, 2007 | 60. m/0.32 mm/0.25 μm, Helium; Program: not specified |
Capillary | DB-Wax | 1657. | Krings, Zelena, et al., 2006 | 30. m/0.32 mm/0.25 μm, He; Program: 45C(5min) => 5C/min => 150C => 10C/min => 240C (10min) |
Capillary | Carbowax 20M | 1656. | Editorial paper, 2005 | Program: not specified |
Capillary | Carbowax 20M | 1662. | Editorial paper, 2005 | Program: not specified |
Capillary | DB-Wax | 1656. | Kim. J.H., Ahn, et al., 2004 | 60. m/0.25 mm/0.25 μm, Helium; Program: 60 0C (3 min) 2 0C/min -> 150 0C 4 0C/min -> 200 0C |
Capillary | Innowax | 1668. | Selli, Kürkçüoglu, et al., 2004 | 60. m/0.25 mm/0.25 μm, He; Program: 50C(10min) => 4C/min => 220C(10min) => 1C/min => 240C |
Capillary | Carbowax 20M | 1620. | Vinogradov, 2004 | Program: not specified |
Capillary | Nukol | 1662. | López and Dufour, 2001 | N2; Column length: 25. m; Column diameter: 0.25 mm; Program: 45C(5min) => 20C/min => 100C(1min) => 3C/min => 190C(40min) |
Capillary | CP-Wax 52CB | 1670. | Muresan, Eillebrecht, et al., 2000 | 50. m/0.32 mm/1.2 μm; Program: 40C(10min) => 3C/min => 190C => 10C/min => 250C(5min) |
Capillary | DB-Wax | 1640. | Hatsuko, Kazuko, et al., 1992 | He; Column length: 30. m; Column diameter: 0.25 mm; Program: not specified |
Capillary | Carbowax 400, Carbowax 20M, Carbowax 1540, Carbowax 4000, Superox 06, PEG 20M, etc. | 1617. | Waggott and Davies, 1984 | Hydrogen; Column length: 50. m; Column diameter: 0.32 mm; Program: not specified |

Lee's RI, non-polar column, temperature ramp

Column type | Active phase | I | Reference | Comment |
---|---|---|---|---|
Capillary | DB-5 | 127.02 | Williams and Horne, 1995 | He, 60. C @ 2. min, 5. K/min; Column length: 25. m; Column diameter: 0.3 mm; Tend: 270. C |

References

Parks, Mosley, et al., 1950
Parks, G.S.; Mosley, J.R.; Peterson, P.V., Jr.,
Heats of combustion and formation of some organic compounds containing oxygen,
J. Chem. Phys., 1950, 18, 152. [all data]
Landrieu, Baylocq, et al., 1929
Landrieu, P.; Baylocq, F.; Johnson, J.R.,
Etude thermochimique dans la serie furanique,
Bull. Soc. Chim. France, 1929, 45, 36-49. [all data]
Miller, 1936
Miller, P.,
The free energy of furfural and some of its derivatives,
Iowa State Coll. J. Sci., 1936, 10, 91-93. [all data]
Cox and Pilcher, 1970
Cox, J.D.; Pilcher, G.,
Thermochemistry of Organic and Organometallic Compounds, Academic Press, New York, 1970, 1-636. [all data]
Parks, Kennedy, et al., 1956
Parks, G.S.; Kennedy, W.D.; Gates, R.R.; Mosley, J.R.; Moore, G.E.; Renquist, M.L.,
Thermal data on organic compounds. XXVI. Some heat capacity, entropy and free energy data for seven compounds containing oxygen.,
Not In System, 1956, 78, 56-59. [all data]
Miller, 1935
Miller, P.,
The free energy of furfural and some of its derivatives,
Iowa State Coll. J. Sci., 1935, 10, 91-93. [all data]
Hough, Mason, et al., 1950
Hough, E.W.; Mason, D.M.; Sage, B.H.,
Heat capacities of several organic liquids,
J. Am. Chem. Soc., 1950, 72, 5775-5777. [all data]
Parks, Kennedy, et al., 1956, 2
Parks, G.S.; Kennedy, W.D.; Gates, R.R.; Mosley, J.R.; Moore, G.E.; Renquist, M.L.,
Thermal Data on Organic Compounds XXVI. Some Heat Capacity, Entropy and Free Energy Data for Seven Compounds Containing Oxygen,
J. Am. Chem. Soc., 1956, 78, 56-9. [all data]
Miller, 1936, 2
Miller, P.,
The Free Energy of Furfural and Some of Its Derivatives,
Iowa State Coll. J. Sci., 1936, 10, 91-3. [all data]
Stephenson and Malanowski, 1987
Stephenson, Richard M.; Malanowski, Stanislaw,
Handbook of the Thermodynamics of Organic Compounds, 1987, https://doi.org/10.1007/978-94-009-3173-2
. [all data]
Ketelaar, van Velden, et al., 2010
Ketelaar, J.A.A.; van Velden, P.F.; Zalm, P.,
Vapour pressures and heats of vaporization of cis- and trans-1,2-dichloroethene,
Recl. Trav. Chim. Pays-Bas, 2010, 66, 12, 721-732, https://doi.org/10.1002/recl.19470661202
. [all data]
Domalski and Hearing, 1996
Domalski, Eugene S.; Hearing, Elizabeth D.,
Heat Capacities and Entropies of Organic Compounds in the Condensed Phase. Volume III,
J. Phys. Chem. Ref. Data, 1996, 25, 1, 1, https://doi.org/10.1063/1.555985
. [all data]