6-Camphenol acetate

Van Den Dool and Kratz RI, non-polar column, temperature ramp

View large format table.

Column type Active phase I Reference Comment
CapillaryHP-51241.Javidnia, Miri, et al., 200530. m/0.25 mm/0.25 μm, He, 3. K/min; Tstart: 60. C; Tend: 260. C

References

Javidnia, Miri, et al., 2005
Javidnia, K.; Miri, R.; Kamalinejad, M.; Edraki, N., Chemical composition of Ferula persica Wild. essential oil from Iran, Flavour Fragr. J., 2005, 20, 6, 605-606, https://doi.org/10.1002/ffj.1496 . [all data]