Aluminum, triethyl-
- Formula: C6H15Al
- Molecular weight: 114.1648
- IUPAC Standard InChIKey: VOITXYVAKOUIBA-UHFFFAOYSA-N
- CAS Registry Number: 97-93-8
- Chemical structure:
View 3d structure (requires JavaScript / HTML 5) - Other names: Triethylaluminum; TEA; Triethylaluminium; UN 1102

Gas phase thermochemistry data

Data compiled by: José A. Martinho Simões
Quantity | Value | Units | Method | Reference | Comment |
---|---|---|---|---|---|
ΔfH°gas | -114.1 ± 5.5 | kJ/mol | Review | Martinho Simões | Selected data. The enthalpy of formation relies on -1792.9 ± 1.9 kJ/mol for the enthalpy of formation of Al(acac)3(cr). Liquid triethylaluminum contains a very small molar fraction of monomer at 298 K, ca. 0.1% Smith, 1967, so that the "real" liquid should be described as [Al(Et)3]2. |
ΔfH°gas | -98.9 ± 6.8 | kJ/mol | Review | Martinho Simões | Liquid triethylaluminum contains a very small molar fraction of monomer at 298 K, ca. 0.1% Smith, 1967, so that the "real" liquid should be described as [Al(Et)3]2. |
ΔfH°gas | -163.7 ± 3.7 | kJ/mol | Review | Martinho Simões | Liquid triethylaluminum contains a very small molar fraction of monomer at 298 K, ca. 0.1% Smith, 1967, so that the "real" liquid should be described as [Al(Et)3]2. |
ΔfH°gas | -144.0 ± 9.1 | kJ/mol | Review | Martinho Simões | Liquid triethylaluminum contains a very small molar fraction of monomer at 298 K, ca. 0.1% Smith, 1967, so that the "real" liquid should be described as [Al(Et)3]2 |
ΔfH°gas | -100.0 ± 5.1 | kJ/mol | Review | Martinho Simões | The enthalpy of formation was quoted from Tel'noi and Rabinovich, 1980 and relies on experimental data in Fic, 1966. Liquid triethylaluminum contains a very small molar fraction of monomer at 298 K, ca. 0.1% Smith, 1967, so that the "real" liquid should be described as [Al(Et)3]2. |

Condensed phase thermochemistry data

Data compiled as indicated in comments:
MS - José A. Martinho Simões
DH - Eugene S. Domalski and Elizabeth D. Hearing
Quantity | Value | Units | Method | Reference | Comment |
---|---|---|---|---|---|
ΔfH°liquid | -187.3 ± 5.1 | kJ/mol | Review | Martinho Simões | Selected data. The enthalpy of formation relies on -1792.9 ± 1.9 kJ/mol for the enthalpy of formation of Al(acac)3(cr). Liquid triethylaluminum contains a very small molar fraction of monomer at 298 K, ca. 0.1% Smith, 1967, so that the "real" liquid should be described as [Al(Et)3]2.; MS |
ΔfH°liquid | -172.1 ± 6.5 | kJ/mol | Review | Martinho Simões | Liquid triethylaluminum contains a very small molar fraction of monomer at 298 K, ca. 0.1% Smith, 1967, so that the "real" liquid should be described as [Al(Et)3]2.; MS |
ΔfH°liquid | -236.9 ± 3.1 | kJ/mol | Review | Martinho Simões | Liquid triethylaluminum contains a very small molar fraction of monomer at 298 K, ca. 0.1% Smith, 1967, so that the "real" liquid should be described as [Al(Et)3]2.; MS |
ΔfH°liquid | -217.2 ± 8.9 | kJ/mol | Review | Martinho Simões | Liquid triethylaluminum contains a very small molar fraction of monomer at 298 K, ca. 0.1% Smith, 1967, so that the "real" liquid should be described as [Al(Et)3]2; MS |
ΔfH°liquid | -173.2 ± 4.6 | kJ/mol | CC-SB | Tel'noi and Rabinovich, 1980 | Value corrected based on a set of ancillary data by J.A. Martinho Simões; The enthalpy of formation was quoted from Tel'noi and Rabinovich, 1980 and relies on experimental data in Fic, 1966. Liquid triethylaluminum contains a very small molar fraction of monomer at 298 K, ca. 0.1% Smith, 1967, so that the "real" liquid should be described as [Al(Et)3]2.; MS |
Quantity | Value | Units | Method | Reference | Comment |
ΔcH°liquid | -5105.7 ± 2.9 | kJ/mol | CC-SB | Pawlenko, 1967 | Please also see Pedley and Rylance, 1977 and Cox and Pilcher, 1970.; MS |
ΔcH°liquid | -5125.4 ± 8.8 | kJ/mol | CC-SB | Shaulov, Shmyreva, et al., 1965 | Please also see Cox and Pilcher, 1970.; MS |
Quantity | Value | Units | Method | Reference | Comment |
S°liquid | 308.0 | J/mol*K | N/A | Rabinovich, Nistratov, et al., 1989 | DH |
S°liquid | 307.8 | J/mol*K | N/A | Sheiman, Nistratov, et al., 1984 | DH |
Constant pressure heat capacity of liquid
Cp,liquid (J/mol*K) | Temperature (K) | Reference | Comment |
---|---|---|---|
239.0 | 298.15 | Rabinovich, Nistratov, et al., 1989 | T = 5 to 313 K.; DH |
239.0 | 298.15 | Sheiman, Nistratov, et al., 1984 | T = 5 to 300 K.; DH |

Phase change data

Data compiled as indicated in comments:
TRC - Thermodynamics Research Center, NIST Boulder Laboratories, Chris Muzny director
MS - José A. Martinho Simões
DH - Eugene S. Domalski and Elizabeth D. Hearing
AC - William E. Acree, Jr., James S. Chickos
Quantity | Value | Units | Method | Reference | Comment |
---|---|---|---|---|---|
Tboil | 466.0 | K | N/A | Dibrivnyi, Dolbneva, et al., 1986 | Uncertainty assigned by TRC = 1. K; TRC |
Quantity | Value | Units | Method | Reference | Comment |
Ttriple | 225.00 | K | N/A | Rabinovich, Nistratov, et al., 1989, 2 | Uncertainty assigned by TRC = 0.02 K; TRC |
Quantity | Value | Units | Method | Reference | Comment |
ΔvapH° | 73.2 ± 2.1 | kJ/mol | RSC | Fowell, 1961 | MS |
Antoine Equation Parameters
log10(P) = A − (B / (T + C))
P = vapor pressure (bar)
T = temperature (K)
View plot Requires a JavaScript / HTML 5 canvas capable browser.
Temperature (K) | A | B | C | Reference | Comment |
---|---|---|---|---|---|
330. to 399. | 7.41394 | 3451.295 | 2.14 | Fic and Dvorak, 1965 | Coefficents calculated by NIST from author's data. |
Enthalpy of fusion
ΔfusH (kJ/mol) | Temperature (K) | Reference | Comment |
---|---|---|---|
10.600 | 225.00 | Rabinovich, Nistratov, et al., 1989 | DH |
10.600 | 225.00 | Sheiman, Nistratov, et al., 1984 | DH |
10.6 | 225. | Domalski and Hearing, 1996 | AC |
Entropy of fusion
ΔfusS (J/mol*K) | Temperature (K) | Reference | Comment |
---|---|---|---|
47.11 | 225.00 | Rabinovich, Nistratov, et al., 1989 | DH |
47.11 | 225.00 | Sheiman, Nistratov, et al., 1984 | DH |

Reaction thermochemistry data

Data compiled by: José A. Martinho Simões
Individual Reactions
C12H30Al2 (g) = 2 (g)
By formula: C12H30Al2 (g) = 2C6H15Al (g)
Quantity | Value | Units | Method | Reference | Comment |
---|---|---|---|---|---|
ΔrH° | 76.0 ± 1.3 | kJ/mol | N/A | Smith, 1972 | The values were derived from the thermochemistry of the equilibrium in the liquid phase and from vapor pressure data Smith, 1972. |
3 (g) +
(l) = AlH3O3 (amorphous) + 3
(g)
By formula: 3H2O (g) + C6H15Al (l) = AlH3O3 (amorphous) + 3C2H6 (g)
Quantity | Value | Units | Method | Reference | Comment |
---|---|---|---|---|---|
ΔrH° | -647.3 ± 6.3 | kJ/mol | RSC | Fowell, 1961 | Please also see Cox and Pilcher, 1970. Liquid triethylaluminum contains a very small molar fraction of monomer at 298 K, ca. 0.1% Smith, 1967, so that the "real" liquid should be described as [Al(Et)3]2. |
C12H30Al2 (l) = 2 (l)
By formula: C12H30Al2 (l) = 2C6H15Al (l)
Quantity | Value | Units | Method | Reference | Comment |
---|---|---|---|---|---|
ΔrH° | 70.8 ± 1.0 | kJ/mol | EqS | Smith, 1967 |
AlI3 (cr) + 2 (l) = 3C4H10AlI (l)
By formula: AlI3 (cr) + 2C6H15Al (l) = 3C4H10AlI (l)
Quantity | Value | Units | Method | Reference | Comment |
---|---|---|---|---|---|
ΔrH° | -73.3 ± 1.4 | kJ/mol | RSC | Smith, 1974 | Please also see Pedley and Rylance, 1977. |
AlBr3 (cr) + 2 (l) = 3C4H10AlBr (l)
By formula: AlBr3 (cr) + 2C6H15Al (l) = 3C4H10AlBr (l)
Quantity | Value | Units | Method | Reference | Comment |
---|---|---|---|---|---|
ΔrH° | -91.4 ± 1.8 | kJ/mol | RSC | Smith, 1974 | Please also see Pedley and Rylance, 1977. |
AlCl3 (cr) + 2 (l) = 3
(l)
By formula: AlCl3 (cr) + 2C6H15Al (l) = 3C4H10AlCl (l)
Quantity | Value | Units | Method | Reference | Comment |
---|---|---|---|---|---|
ΔrH° | -66.8 ± 1.3 | kJ/mol | RSC | Smith, 1974 | Please also see Pedley and Rylance, 1977. |
C2H5AlI2 (l) + (l) = 2C4H10AlI (l)
By formula: C2H5AlI2 (l) + C6H15Al (l) = 2C4H10AlI (l)
Quantity | Value | Units | Method | Reference | Comment |
---|---|---|---|---|---|
ΔrH° | -36.2 ± 0.7 | kJ/mol | RSC | Smith, 1974 | Please also see Pedley and Rylance, 1977. |
C2H5AlBr2 (l) + (l) = 2C4H10AlBr (l)
By formula: C2H5AlBr2 (l) + C6H15Al (l) = 2C4H10AlBr (l)
Quantity | Value | Units | Method | Reference | Comment |
---|---|---|---|---|---|
ΔrH° | -39.7 ± 0.8 | kJ/mol | RSC | Smith, 1974 | Please also see Pedley and Rylance, 1977. |
By formula: C2H5AlCl2 (l) + C6H15Al (l) = 2C4H10AlCl (l)
Quantity | Value | Units | Method | Reference | Comment |
---|---|---|---|---|---|
ΔrH° | -39.5 ± 0.8 | kJ/mol | RSC | Smith, 1974 | Please also see Pedley and Rylance, 1977. |

References

Martinho Simões
Martinho Simões, J.A.,
Private communication (see http://webbook.nist.gov/chemistry/om/). [all data]
Smith, 1967
Smith, M.B.,
J. Phys. Chem., 1967, 71, 364. [all data]
Tel'noi and Rabinovich, 1980
Tel'noi, V.I.; Rabinovich, I.B.,
Russ. Chem. Rev., 1980, 49, 603. [all data]
Fic, 1966
Fic, V.,
Chem. Prum., 1966, 16, 607. [all data]
Pawlenko, 1967
Pawlenko, S.,
Chem. Ber., 1967, 100, 3591. [all data]
Pedley and Rylance, 1977
Pedley, J.B.; Rylance, J.,
Computer Analysed Thermochemical Data: Organic and Organometallic Compounds, University of Sussex, Brigton, 1977. [all data]
Cox and Pilcher, 1970
Cox, J.D.; Pilcher, G.,
Thermochemistry of Organic and Organometallic Compounds
in Academic Press, New York, 1970. [all data]
Shaulov, Shmyreva, et al., 1965
Shaulov, Yu.Kh.; Shmyreva, G.O.; Tubyanskaya, V.S.,
Russ. J. Phys. Chem., 1965, 39, 51. [all data]
Rabinovich, Nistratov, et al., 1989
Rabinovich, I.B.; Nistratov, V.P.; Sheiman, M.S.; Klimov, K.N.; Kamelov, G.P.; Zorin, A.D.,
Specific heat and thermodynamic functions of triethylaluminium,
Zhur. Fiz. Khim., 1989, 63, 522-525. [all data]
Sheiman, Nistratov, et al., 1984
Sheiman, M.S.; Nistratov, V.P.; Kamelova, G.P.; Rabinovich, I.B.,
Low-temperature heat capacity of organic compounds of aluminum and zinc, Probl. Kalorim. Khim. Termodin., Dokl. Vses. Konf.,
10th, 1984, 2, 457-459. [all data]
Dibrivnyi, Dolbneva, et al., 1986
Dibrivnyi, V.N.; Dolbneva, T.N.; Dikii, M.A.,
Saturated vapor pressure and vaporization enthalpies of aromatic peroxides
in Vses. Konf. po Kalorimetrii i Khim. Termodinamike, 11th, Novosibirsk, Nr 2, p 115, 1986. [all data]
Rabinovich, Nistratov, et al., 1989, 2
Rabinovich, I.B.; Nistratov, V.P.; Sheiman, M.S.; Klimov, K.N.; Kamelova, G.P.; Zorin, A.D.,
Specific heat and thermodynamic functions of triethylaluminium,
Zh. Fiz. Khim., 1989, 63, 522-5. [all data]
Fowell, 1961
Fowell, P.A.,
Ph. D. Thesis, University of Manchester, 1961. [all data]
Fic and Dvorak, 1965
Fic, V.; Dvorak, J.,
Organo-Aluminum Compounds. 1. Vapor Pressure of Triethyl Aluminum and Diethyl Aluminium Chloride,
Chem. Prum., 1965, 15, 732-735. [all data]
Domalski and Hearing, 1996
Domalski, Eugene S.; Hearing, Elizabeth D.,
Heat Capacities and Entropies of Organic Compounds in the Condensed Phase. Volume III,
J. Phys. Chem. Ref. Data, 1996, 25, 1, 1, https://doi.org/10.1063/1.555985
. [all data]
Smith, 1972
Smith, M.B.,
J. Organometal. Chem., 1972, 46, 31. [all data]
Smith, 1974
Smith, M.B.,
J. Organometal. Chem., 1974, 76, 171. [all data]