Phenol, 4-(triphenylmethyl)-
- Formula: C25H20O
- Molecular weight: 336.4257
- IUPAC Standard InChIKey: NIPKXTKKYSKEON-UHFFFAOYSA-N
- CAS Registry Number: 978-86-9
- Chemical structure:
View 3d structure (requires JavaScript / HTML 5) - Other names: p-Cresol, α,α,α-triphenyl-; p-Tritylphenol; 4-Tritylphenol; p-Triphenylmethylphenol

Phase change data

Data compiled by: Thermodynamics Research Center, NIST Boulder Laboratories, Chris Muzny director
Quantity | Value | Units | Method | Reference | Comment |
---|---|---|---|---|---|
Tfus | 555. | K | N/A | Welsh and Drake, 1938 | Uncertainty assigned by TRC = 4. K |

References

Welsh and Drake, 1938
Welsh, L.H.; Drake, N.L.,
The Condensation of Tertiary Aryl Substituted Carbinos with Phenol in the Presence of Aluminum Chloride,
J. Am. Chem. Soc., 1938, 60, 59. [all data]