Propanoic acid, 2-methyl-, 2-methylpropyl ester
- Formula: C8H16O2
- Molecular weight: 144.2114
- IUPAC Standard InChIKey: RXGUIWHIADMCFC-UHFFFAOYSA-N
- CAS Registry Number: 97-85-8
- Chemical structure:
View 3d structure (requires JavaScript / HTML 5) - Other names: Isobutyric acid, isobutyl ester; Isobutyl isobutyrate; 2-Methylpropyl isobutyrate; 2-Methylpropyl 2-methylpropanoate; 2-Methylpropyl 2-methylpropionate; Isobutyl isobutanoate; Isobutyl 2-methylpropanoate; Isobutylester kyseliny isomaselne; UN 2528; Isobutyl ester of 2-methylpropanoic acid; NSC 6538

Gas phase thermochemistry data

Data compiled by: Hussein Y. Afeefy, Joel F. Liebman, and Stephen E. Stein
Quantity | Value | Units | Method | Reference | Comment |
---|---|---|---|---|---|
ΔfH°gas | -542.9 ± 1.7 | kJ/mol | Ccb | Verevkin, Beckhaus, et al., 1996 |

Condensed phase thermochemistry data

Data compiled by: Hussein Y. Afeefy, Joel F. Liebman, and Stephen E. Stein
Quantity | Value | Units | Method | Reference | Comment |
---|---|---|---|---|---|
ΔfH°liquid | -587.4 ± 1.6 | kJ/mol | Ccb | Verevkin, Beckhaus, et al., 1996 | |
Quantity | Value | Units | Method | Reference | Comment |
ΔcH°liquid | -4847.4 ± 1.6 | kJ/mol | Ccb | Verevkin, Beckhaus, et al., 1996 | Corresponding ΔfHºliquid = -587.3 kJ/mol (simple calculation by NIST; no Washburn corrections) |

Phase change data

Data compiled as indicated in comments:
BS - Robert L. Brown and Stephen E. Stein
TRC - Thermodynamics Research Center, NIST Boulder Laboratories, Chris Muzny director
AC - William E. Acree, Jr., James S. Chickos
ALS - Hussein Y. Afeefy, Joel F. Liebman, and Stephen E. Stein
DRB - Donald R. Burgess, Jr.
Quantity | Value | Units | Method | Reference | Comment |
---|---|---|---|---|---|
Tboil | 421. ± 1. | K | AVG | N/A | Average of 7 values; Individual data points |
Quantity | Value | Units | Method | Reference | Comment |
Tfus | 192.50 | K | N/A | Timmermans, 1922 | Uncertainty assigned by TRC = 0.15 K; TRC |
Quantity | Value | Units | Method | Reference | Comment |
Tc | 601.89 | K | N/A | Brown, 1906 | Uncertainty assigned by TRC = 6. K; TRC |
Quantity | Value | Units | Method | Reference | Comment |
ΔvapH° | 48.5 | kJ/mol | GS | Verevkin and Emel'yanenko, 2008 | Based on data from 274. to 319. K.; AC |
ΔvapH° | 44.49 ± 0.39 | kJ/mol | V | Verevkin, Beckhaus, et al., 1996 | ALS |
ΔvapH° | 44.5 | kJ/mol | N/A | Verevkin, Beckhaus, et al., 1996 | DRB |
ΔvapH° | 44.5 ± 0.1 | kJ/mol | GS | Verevkin, Beckhaus, et al., 1996 | Based on data from 278. to 313. K.; AC |
Enthalpy of vaporization
ΔvapH (kJ/mol) | Temperature (K) | Method | Reference | Comment |
---|---|---|---|---|
46.9 | 292. | A | Stephenson and Malanowski, 1987 | Based on data from 277. to 421. K. See also Stull, 1947.; AC |
Antoine Equation Parameters
log10(P) = A − (B / (T + C))
P = vapor pressure (bar)
T = temperature (K)
View plot Requires a JavaScript / HTML 5 canvas capable browser.
Temperature (K) | A | B | C | Reference | Comment |
---|---|---|---|---|---|
277.3 to 420.7 | 4.76033 | 1806.356 | -40.698 | Stull, 1947 | Coefficents calculated by NIST from author's data. |

Normal alkane RI, polar column, temperature ramp

Data compiled by: NIST Mass Spectrometry Data Center, William E. Wallace, director

Column type CapillaryCapillaryCapillaryCapillaryCapillary
Active phase CP-Wax 52CBDB-WaxCarbowax 20MCarbowax 20MCarbowax 20M
Column length (m) 30.60.80.50.50.
Carrier gas HeHe N2N2
Substrate
Column diameter (mm)  0.250.20.220.22
Phase thickness (μm) 0.320.25
Tstart (C) 50.40.70.80.80.
Tend (C) 220.200.170.200.200.
Heat rate (K/min) 6.2.2.3.3.
Initial hold (min) 2.2.
Final hold (min) 20.
I 1089.1092.1084.1090.1091.
ReferenceAudino, Alzogaray, et al., 2007Umano, Hagi, et al., 2000Anker, Jurs, et al., 1990Mihara, Tateba, et al., 1988Mihara, Tateba, et al., 1988
Comment MSDC-RI MSDC-RI MSDC-RI MSDC-RI MSDC-RI
Column type CapillaryCapillary
Active phase Carbowax 20MCarbowax 20M
Column length (m) 50.50.
Carrier gas N2N2
Substrate
Column diameter (mm) 0.220.22
Phase thickness (μm)
Tstart (C) 80.80.
Tend (C) 200.200.
Heat rate (K/min) 3.3.
Initial hold (min)
Final hold (min)
I 1090.1091.
ReferenceMihara, Tateba, et al., 1987Mihara, Tateba, et al., 1987
Comment MSDC-RI MSDC-RI

Kovats' RI, non-polar column, isothermal

Data compiled by: NIST Mass Spectrometry Data Center, William E. Wallace, director

Column type CapillaryPackedPackedPackedPacked
Active phase OV-1SE-30SE-30OV-1SE-30
Column length (m)  3.73. 3.7
Carrier gas   N2
Substrate  Celaton (62-72 mesh)Chromosorb W AW (60-80 mesh) Celite 560
Column diameter (mm)
Phase thickness (μm)
Temperature (C) 333.150.100.150.150.
I 900.899.896.900.900.
ReferenceHu, Lu, et al., 2006Ashes and Haken, 1974Chastrette, Heintz, et al., 1974Ashes and Haken, 1971Germaine and Haken, 1969
Comment MSDC-RI MSDC-RI MSDC-RI MSDC-RI MSDC-RI

References

Verevkin, Beckhaus, et al., 1996
Verevkin, S.P.; Beckhaus, H.-D.; Belen'kaja, R.S.; Rakus, K.; Ruchardt, C.,
Geminal substituent effects Part 9. Standard enthalpies of formation and strain free increments of branched esters and ethers,
Thermochim. Acta, 1996, 279, 47-64. [all data]
Timmermans, 1922
Timmermans, J.,
Investigation of the Freezing Point of Organic Substances VII,
Bull. Soc. Chim. Belg., 1922, 31, 389. [all data]
Brown, 1906
Brown, J.C.,
The critical temperature and value of ml/theta of some carbon compounds,
J. Chem. Soc., Trans., 1906, 89, 311. [all data]
Verevkin and Emel'yanenko, 2008
Verevkin, Sergey P.; Emel'yanenko, Vladimir N.,
Transpiration method: Vapor pressures and enthalpies of vaporization of some low-boiling esters,
Fluid Phase Equilibria, 2008, 266, 1-2, 64-75, https://doi.org/10.1016/j.fluid.2008.02.001
. [all data]
Stephenson and Malanowski, 1987
Stephenson, Richard M.; Malanowski, Stanislaw,
Handbook of the Thermodynamics of Organic Compounds, 1987, https://doi.org/10.1007/978-94-009-3173-2
. [all data]
Stull, 1947
Stull, Daniel R.,
Vapor Pressure of Pure Substances. Organic and Inorganic Compounds,
Ind. Eng. Chem., 1947, 39, 4, 517-540, https://doi.org/10.1021/ie50448a022
. [all data]