Propanoic acid, 2-methyl-, anhydride
- Formula: C8H14O3
- Molecular weight: 158.1950
- IUPAC Standard InChIKey: LSACYLWPPQLVSM-UHFFFAOYSA-N
- CAS Registry Number: 97-72-3
- Chemical structure:
View 3d structure (requires JavaScript / HTML 5) - Other names: Isobutyric anhydride; Isobutryic anhydride; Isobutyric acid anhydride; Isobutyryl anhydride; 2-Methylpropanoic anhydride; (iso-C3H7CO)2O; 2-Methylpropanoic acid anhydride; UN 2530; Propanoic acid, 2-methyl-, 1,1'-anhydride

Phase change data

Data compiled by: Robert L. Brown and Stephen E. Stein
Quantity | Value | Units | Method | Reference | Comment |
---|---|---|---|---|---|
Tboil | 455.2 | K | N/A | Aldrich Chemical Company Inc., 1990 |

Reaction thermochemistry data

Data compiled by: Hussein Y. Afeefy, Joel F. Liebman, and Stephen E. Stein
Individual Reactions
By formula: H2O + C8H14O3 = 2C4H8O2
Quantity | Value | Units | Method | Reference | Comment |
---|---|---|---|---|---|
ΔrH° | -61.04 | kJ/mol | Cm | Conn, Kistiakowsky, et al., 1942 | liquid phase; Heat of hydrolysis at 303 K |

References

Aldrich Chemical Company Inc., 1990
Aldrich Chemical Company Inc.,
Catalog Handbook of Fine Chemicals, Aldrich Chemical Company, Inc., Milwaukee WI, 1990, 1. [all data]
Conn, Kistiakowsky, et al., 1942
Conn, J.B.; Kistiakowsky, G.B.; Roberts, R.M.; Smith, E.A.,
Heats of organic reactions. XIII. Heats of hydrolysis of some acid anhydrides,
J. Am. Chem. Soc., 1942, 64, 1747-17. [all data]