Butanedioic acid, hydroxy-, (S)-
- Formula: C4H6O5
- Molecular weight: 134.0874
- IUPAC Standard InChIKey: BJEPYKJPYRNKOW-UWTATZPHSA-N
- CAS Registry Number: 97-67-6
- Chemical structure:
View 3d structure (requires JavaScript / HTML 5) - Stereoisomers:
- Other names: Malic acid, L-; (-)-Hydroxysuccinic acid; (-)-Malic acid; (S)-Malic acid; Apple acid; L-(-)-Malic acid; L-Malic acid; S-(-)-Malic acid; (S)-Hydroxybutanedioic acid; Malic acid-, (L-form)-; (2S)-2-Hydroxybutanedioic acid; Butanedioic acid, 2-hydroxy-, (2S)-; Butanedioic acid, hydroxy-, (2S)-; NSC 9232; S-2-Hydroxybutanedioic acid

Condensed phase thermochemistry data

Data compiled by: Hussein Y. Afeefy, Joel F. Liebman, and Stephen E. Stein
Quantity | Value | Units | Method | Reference | Comment |
---|---|---|---|---|---|
ΔfH°solid | -1103.7 ± 4.2 | kJ/mol | Ccb | Wilhoit and Shiao, 1964 | |
Quantity | Value | Units | Method | Reference | Comment |
ΔcH°solid | -1328.0 ± 4.2 | kJ/mol | Ccb | Wilhoit and Shiao, 1964 | Corresponding ΔfHºsolid = -1103.6 kJ/mol (simple calculation by NIST; no Washburn corrections) |

Phase change data

Data compiled by: Thermodynamics Research Center, NIST Boulder Laboratories, Chris Muzny director
Quantity | Value | Units | Method | Reference | Comment |
---|---|---|---|---|---|
Tfus | 372.7 | K | N/A | Wilhoit and Shiao, 1964, 2 | Uncertainty assigned by TRC = 0.7 K |

References

Wilhoit and Shiao, 1964
Wilhoit, R.C.; Shiao, D.,
Thermochemistry of biologically important compounds. Heats of combustion of solid organic acids.,
J. Chem. Eng. Data, 1964, 9, 595-599. [all data]
Wilhoit and Shiao, 1964, 2
Wilhoit, R.C.; Shiao, D.,
Thermochemistry of Biologically Important Compounds. Heats of Combustion of Solid Organic Acids,
J. Chem. Eng. Data, 1964, 9, 595. [all data]