3-(Pronanoyloxy)-estra-1,3,5(10)-trien-17-one
- Formula: C21H26O3
- Molecular weight: 326.4293
- IUPAC Standard InChIKey: ROFBJLDRYQWJFI-UHFFFAOYSA-N
- CAS Registry Number: 975-64-4
- Chemical structure:

Phase change data

Data compiled by: William E. Acree, Jr., James S. Chickos
Enthalpy of fusion
ΔfusH (kcal/mol) | Temperature (K) | Method | Reference |
---|---|---|---|
5.50 | 409. | DSC | Yano, Eiraku, et al., 1990 |

Van Den Dool and Kratz RI, non-polar column, temperature ramp

Column type | Active phase | I | Reference | Comment |
---|---|---|---|---|
Capillary | 5 % Phenyl methyl siloxane | 2442. | Zaikin, 2010 | 30. m/0.25 mm/0.25 μm, 15. K/min, 270. C @ 15. min; Tstart: 60. C |

References

Yano, Eiraku, et al., 1990
Yano, Shinichi; Eiraku, Michitaka; Tomiyama, Makoto; Sugihara, Toshiharu,
Mesogenicity of testosterone and estrone derivatives,
Liquid Crystals, 1990, 7, 4, 537-544, https://doi.org/10.1080/02678299008033830
. [all data]
Zaikin, 2010
Zaikin, V.G.,
Personal communication: Retention indices measured during 2010, 2010. [all data]