Phenol, 2-methoxy-4-(1-propenyl)-
- Formula: C10H12O2
- Molecular weight: 164.2011
- IUPAC Standard InChIKey: BJIOGJUNALELMI-UHFFFAOYSA-N
- CAS Registry Number: 97-54-1
- Chemical structure:
View 3d structure (requires JavaScript / HTML 5) - Stereoisomers:
- Other names: Isoeugenol; Phenol, 2-methoxy-4-propenyl-; 2-Methoxy-4-(1-propenyl)phenol; 2-Methoxy-4-propenylphenol; 4-Hydroxy-3-methoxypropenylbenzene; 4-Propenylguaiacol; Isoeugenol,c&t; 3-Methoxy-4-hydroxy-1-propenylbenzene; 1-Hydroxy-2-methoxy-4-propenylbenzene; 4-Hydroxy-3-methoxy-1-propenylbenzene; NCI-C60979; 1-(3-Methoxy-4-hydroxyphenyl)-1-propene; NSC 6769; Phenol, 2-methoxy-4-(1-propen-1-yl)-; Isoeugenol (I); Isoeugenol (II); 4-(1-Propenyl)-2-methoxyphenol (cis-isoeugenol); trans-Isoeugenol; Propenyl guaiacol; 2-Methoxy-4-propenylphenol (isoeugenol); o-Eugenol, isomer; 2-Methoxy-4-(1-propenyl)phenol (isoeugenol)

Phase change data

Data compiled as indicated in comments:
TRC - Thermodynamics Research Center, NIST Boulder Laboratories, Chris Muzny director
AC - William E. Acree, Jr., James S. Chickos
Quantity | Value | Units | Method | Reference | Comment |
---|---|---|---|---|---|
Tboil | 526.65 | K | N/A | Perkin, 1896 | Uncertainty assigned by TRC = 2. K; TRC |
Enthalpy of vaporization
ΔvapH (kJ/mol) | Temperature (K) | Reference | Comment |
---|---|---|---|
60.7 | 374. | Dykyj, Seprakova, et al., 1957 | Based on data from 359. to 540. K.; AC |
Antoine Equation Parameters
log10(P) = A − (B / (T + C))
P = vapor pressure (bar)
T = temperature (K)
View plot Requires a JavaScript / HTML 5 canvas capable browser.
Temperature (K) | A | B | C | Reference | Comment |
---|---|---|---|---|---|
359.5 to 540.7 | 5.13146 | 2590.027 | -35.864 | Stull, 1947 | Coefficents calculated by NIST from author's data. |

Normal alkane RI, non-polar column, custom temperature program

Data compiled by: NIST Mass Spectrometry Data Center, William E. Wallace, director

Column type CapillaryCapillaryCapillaryCapillaryCapillary
Active phase ZB-1 MSDB-1HP-5HP-5HP-5
Column length (m) 30.60.30.30.30.
Carrier gas HeliumHelium  He
Substrate
Column diameter (mm) 0.250.250.250.250.25
Phase thickness (μm) 0.250.250.250.250.25
Program 50 0C 3 0C/min -> 150 0C (10 min) 10 0C/min -> 250 0C50 0C (5 min) 3 0C/min -> 120 0C 5 0C/min -> 250 0C (3 min) 15 0C/min -> 300 0C (20 min)40 0C (2 min) 5 0C/min -> 80 0C 7 oC/min -> 160 0C 9 0C/min -> 200 0C 20 0C/min -> 280 0C (10 min)not specified60C(4min) => 1C/min => 64C => 2.5C/min => 155C => 5C/min => 250C
I 1410.1427.1402.1408.1451.
ReferenceAl-Reza, Rahman, et al., 2010Delort and Jaquier, 2009Zhao, Li, et al., 2008Zhao, Li, et al., 2008Jordan, Martinez, et al., 2006
Comment MSDC-RI MSDC-RI MSDC-RI MSDC-RI MSDC-RI
Column type CapillaryCapillaryCapillaryCapillaryCapillary
Active phase DB-5SE-54HP-5HP-5HP-5MS
Column length (m) 30.30.30.30.30.
Carrier gas HeHeHeHeHe
Substrate
Column diameter (mm) 0.250.320.250.250.25
Phase thickness (μm) 0.250.250.250.250.25
Program 40C (5min) => 2C/min => 250C(15min) => 5C/min => 270C (10min)40C(2min) => 40C/min => 50C(2min) => 6C/min => 180C => 15C/min => 230C (10min)60C(4min) => 1C/min => 64C => 2.5C/min => 155C => 5C/min => 250C60C (4min) => 1C/min => 64C => 2.5C/min => 155C => 5C/min => 250C40C (10min) => 3C/min => 120C => 10C/min => 250C (5min)
I 1404.1460.1451.1451.1456.
ReferenceMassardo, Senatore, et al., 2006Buettner, 2004Sotomayor, Martínez, et al., 2004Jordán, Martínez, et al., 2003Ansorena, Gimeno, et al., 2001
Comment MSDC-RI MSDC-RI MSDC-RI MSDC-RI MSDC-RI
Column type CapillaryCapillaryCapillaryCapillary
Active phase HP-5DB-1DB-5OV-101
Column length (m) 30.30.30.
Carrier gas HeH2
Substrate
Column diameter (mm) 0.250.250.25
Phase thickness (μm) 0.250.25
Program 40C (10min) => 3C/min => 120C => 10C/min => 250C (5min)40 0C 3 K/min -> 175 0C 15 K/min -> 240 0C (10 min)not specifiednot specified
I 1454.1422.1460.1438.
ReferenceAnsorena, Astiasarán, et al., 2000Dorman, Figueiredo, et al., 2000Garneau, Bouhajib, et al., 1994Shibamoto, 1987
Comment MSDC-RI MSDC-RI MSDC-RI MSDC-RI

Van Den Dool and Kratz RI, non-polar column, custom temperature program

Data compiled by: NIST Mass Spectrometry Data Center, William E. Wallace, director

Column type CapillaryCapillaryCapillary
Active phase BPX-5LM-5SE-52
Column length (m) 30.30.60.
Carrier gas  HeHe
Substrate
Column diameter (mm) 0.250.250.32
Phase thickness (μm) 0.250.250.40
Program 35C(5min) => 3C/min => 210C => 40C/min => 240C (4min)60C(2min) => 15C/min => 180C => 5C/min => 280C(5min)45 C (6 min) 3 C/min -> 111 0C 2 C/min -> 160 C 3 C/min -> 300 C (15 min)
I 1403.1414.81452.
ReferenceCardeal, da Silva, et al., 2006Ré-Poppi and Santiago-Silva, 2002Mondello, Dugo, et al., 1995
Comment MSDC-RI MSDC-RI MSDC-RI

Van Den Dool and Kratz RI, non-polar column, temperature ramp

View large format table.

Column type Active phase I Reference Comment
CapillaryHP-5MS1436.3Zeng, Zhao, et al., 200730. m/0.25 mm/0.25 μm, He, 4. K/min; Tstart: 80. C; Tend: 300. C
CapillaryCP Sil 8 CB1447.Mahadevan and Farmer, 200660. C @ 5. min, 4. K/min, 220. C @ 30. min; Column length: 50. m; Column diameter: 0.32 mm
CapillaryHP-5MS1459.4Zhao C.X., Li, et al., 200630. m/0.25 mm/0.25 μm, He, 4. K/min; Tstart: 80. C; Tend: 300. C
CapillaryDB-51448.Nogueira, Bittrich, et al., 200130. m/0.25 mm/0.25 μm, H2, 3. K/min; Tstart: 60. C; Tend: 240. C
CapillaryHP-51397.Song, Sawamura, et al., 200030. m/0.25 mm/0.25 μm, He, 2. K/min; Tstart: 70. C; Tend: 230. C
CapillaryDB-5MS1428.Chassagne, Boulanger, et al., 199930. m/0.25 mm/0.25 μm, H2, 2. K/min; Tstart: 40. C; Tend: 200. C
CapillaryDB-11439.Stashenko, Prada, et al., 199660. m/0.25 mm/0.25 μm, He, 50. C @ 5. min, 3.5 K/min; Tend: 250. C

Van Den Dool and Kratz RI, polar column, temperature ramp

View large format table.

Column type Active phase I Reference Comment
CapillaryDB-Wax Etr2350.Aubert C. and Pitrat M., 200630. m/0.25 mm/0.25 μm, He, 40. C @ 3. min, 5. K/min, 250. C @ 15. min
CapillaryCP-Wax 52CB2336.Mahadevan and Farmer, 200660. C @ 5. min, 4. K/min, 220. C @ 30. min; Column length: 50. m; Column diameter: 0.32 mm
CapillaryStabilwax2319.Fang and Qian, 200530. m/0.32 mm/1. μm, N2, 40. C @ 2. min, 4. K/min, 230. C @ 10. min
CapillaryDB-Wax2356.Aubert, Ambid, et al., 200330. m/0.32 mm/0.5 μm, 40. C @ 3. min, 3. K/min, 245. C @ 20. min
CapillaryDB-Wax2271.Choi and Sawamura, 200060. m/0.25 mm/0.25 μm, N2, 70. C @ 2. min, 2. K/min, 230. C @ 20. min
CapillaryDB-Wax2330.Chassagne, Boulanger, et al., 199930. m/0.25 mm/0.25 μm, H2, 60. C @ 3. min, 2. K/min; Tend: 220. C
CapillaryDB-Wax2268.Stashenko, Prada, et al., 199660. m/0.25 mm/0.25 μm, He, 50. C @ 5. min, 2.5 K/min; Tend: 180. C
CapillaryCarbowax 20M2322.Mondello, Dugo, et al., 199560. m/0.32 mm/0.425 μm, He, 45. C @ 3. min, 3. K/min, 300. C @ 20. min
CapillaryCP-Wax 58CB2316.Pabst, Barron, et al., 199130. m/0.25 mm/0.22 μm, He, 3. K/min; Tstart: 40. C; Tend: 220. C
CapillaryCarbowax 20M2332.Chen, Kuo, et al., 1986He, 50. C @ 5. min, 2. K/min, 200. C @ 40. min; Column length: 50. m; Column diameter: 0.32 mm

Normal alkane RI, non-polar column, temperature ramp

View large format table.

Column type Active phase I Reference Comment
CapillaryBPX-51468.Bieri and Marriott, 200830. m/0.25 mm/0.25 μm, Hydrogen, 3. K/min; Tstart: 100. C; Tend: 999. C
CapillaryBPX-51465.Bieri and Marriott, 200830. m/0.25 mm/0.25 μm, Hydrogen, 3. K/min; Tstart: 60. C; Tend: 999. C
CapillaryBPX-51466.Bieri and Marriott, 200830. m/0.25 mm/0.25 μm, Hydrogen, 3. K/min; Tstart: 60. C; Tend: 999. C
CapillaryBPX-51468.Bieri and Marriott, 200830. m/0.25 mm/0.25 μm, Hydrogen, 3. K/min; Tstart: 60. C; Tend: 999. C
CapillaryBPX-51474.Bieri and Marriott, 200830. m/0.25 mm/0.25 μm, Hydrogen, 3. K/min; Tstart: 60. C; Tend: 999. C
CapillaryBPX-51471.Bieri and Marriott, 200830. m/0.25 mm/0.25 μm, Hydrogen, 5. K/min; Tstart: 60. C; Tend: 999. C
CapillaryEquity-5 MS1452.Mondello, Casilli, et al., 200830. m/0.25 mm/0.25 μm, Helium, 1.5 K/min; Tstart: 40. C; Tend: 260. C
CapillaryCol-Elite 5MS1404.Gudaityte and Venskutonis R.P., 200730. m/0.25 mm/0.25 μm, He, 3. K/min; Tstart: 30. C; Tend: 246. C
CapillaryDB-51436.Xu, Fan, et al., 200730. m/0.32 mm/0.25 μm, He, 40. C @ 2. min, 4. K/min, 250. C @ 5. min
CapillaryHP-11415.Castel, Fernandez, et al., 200650. m/0.2 mm/0.5 μm, He, 2. K/min, 250. C @ 120. min; Tstart: 60. C
CapillaryDB-51396.Choi, 200630. m/0.25 mm/0.25 μm, N2, 70. C @ 2. min, 2. K/min, 230. C @ 20. min
CapillaryHP-5MS1457.Kim, Abd El-Aty, et al., 200630. m/0.25 mm/0.25 μm, He, 50. C @ 4. min, 5. K/min, 280. C @ 10. min
CapillaryFSOT-RSL-2001405.Schmidt, Jirovetz, et al., 200630. m/0.32 mm/0.25 μm, Hydrogen, 40. C @ 5. min, 6. K/min, 280. C @ 5. min
CapillaryDB-11430.Choi, 200460. m/0.25 mm/0.25 μm, N2, 70. C @ 2. min, 2. K/min, 230. C @ 20. min
CapillaryDB-11403.Tu, Onishi, et al., 200360. m/0.25 mm/0.25 μm, N2, 70. C @ 2. min, 2. K/min, 230. C @ 20. min
CapillaryDB-51438.Kotseridis and Baumes, 200030. m/0.32 mm/0.5 μm, H2, 60. C @ 3. min, 3. K/min, 245. C @ 20. min
CapillarySPB-11420.Choo, Wong, et al., 199950. m/0.2 mm/0.33 μm, 4. K/min; Tstart: 60. C; Tend: 260. C
CapillaryOV-1011435.Menon, Chacko, et al., 1999N2, 1. K/min, 200. C @ 20. min; Column length: 50. m; Column diameter: 0.2 mm; Tstart: 80. C
CapillaryDB-11429.Stashenko, Torres, et al., 199560. m/0.25 mm/0.25 μm, He, 50. C @ 5. min, 3.5 K/min; Tend: 250. C

Normal alkane RI, polar column, temperature ramp

View large format table.

Column type Active phase I Reference Comment
CapillaryDB-Wax2266.Choi, 200660. m/0.25 mm/0.25 μm, N2, 70. C @ 2. min, 2. K/min, 230. C @ 20. min
CapillaryDB-Wax Etr2279.Ibarz, Ferreira, et al., 200660. m/0.25 mm/0.25 μm, He, 40. C @ 5. min, 2. K/min, 230. C @ 100. min
CapillaryDB-Wax2271.Choi, 200460. m/0.25 mm/0.25 μm, N2, 70. C @ 2. min, 2. K/min, 230. C @ 20. min
CapillaryTC-Wax2326.Miyazawa and Okuno, 2003He, 4. K/min, 250. C @ 30. min; Column length: 60. m; Column diameter: 0.25 mm; Tstart: 80. C
CapillaryDB-Wax2352.Kotseridis and Baumes, 200030. m/0.32 mm/0.5 μm, H2, 60. C @ 3. min, 3. K/min, 245. C @ 20. min
CapillarySupelcowax-102338.Choo, Wong, et al., 199930. m/0.25 mm/0.25 μm, 4. K/min; Tstart: 60. C; Tend: 220. C
CapillaryCarbowax2269.Menon, Chacko, et al., 1999N2, 1. K/min, 200. C @ 20. min; Column length: 50. m; Column diameter: 0.2 mm; Tstart: 80. C
CapillaryDB-Wax2308.Hatsuko, Kazuko, et al., 1992He, 60. C @ 10. min, 3. K/min; Column length: 30. m; Column diameter: 0.25 mm; Tend: 240. C
CapillaryCarbowax 20M2304.Kawakami and Kobayashi, 1991He, 60. C @ 4. min, 2. K/min; Column length: 50. m; Column diameter: 0.25 mm; Tend: 180. C

Normal alkane RI, polar column, custom temperature program

View large format table.

Column type Active phase I Reference Comment
CapillarySupelcowax2330.Garneau, Bouhajib, et al., 1994Column length: 30. m; Column diameter: 0.25 mm; Program: not specified
CapillaryDB-Wax2299.Hatsuko, Kazuko, et al., 1992He; Column length: 30. m; Column diameter: 0.25 mm; Program: not specified
CapillaryCarbowax 20M2269.Shibamoto, 1987Program: not specified

References

Perkin, 1896
Perkin, W.H.,
LXIX. On Magnetic Rotatory Power, especially of Aromatic Compounds,
J. Chem. Soc., 1896, 69, 1025-1257. [all data]
Dykyj, Seprakova, et al., 1957
Dykyj, J.; Seprakova, M.; Paulech, J.,
Chem. Zvesti, 1957, 11, 461. [all data]
Stull, 1947
Stull, Daniel R.,
Vapor Pressure of Pure Substances. Organic and Inorganic Compounds,
Ind. Eng. Chem., 1947, 39, 4, 517-540, https://doi.org/10.1021/ie50448a022
. [all data]