2-Cyclohexen-1-ol, 2-methyl-5-(1-methylethenyl)-, propanoate
- Formula: C13H20O2
- Molecular weight: 208.2967
- IUPAC Standard InChIKey: DFVXNZOMAOGTBL-UHFFFAOYSA-N
- CAS Registry Number: 97-45-0
- Chemical structure:
View 3d structure (requires JavaScript / HTML 5) - Stereoisomers:
- Other names: p-Mentha-6,8-dien-2-ol, propionate; Carveol propionate; Carvyl propionate; l-Carvyl propionate; 2-Cyclohexen-1-ol, 2-methyl-5-(1-methylethenyl)-, propionate; l-p-Mentha-6,8(9)-dien-2-yl propionate; p-mentha-1(6),8-dien-2-yl propionate

Phase change data

Data compiled by: Robert L. Brown and Stephen E. Stein
Reduced pressure boiling point
Tboil (K) | Pressure (bar) | Reference |
---|---|---|
352.2 | 0.0003 | Aldrich Chemical Company Inc., 1990 |

Normal alkane RI, non-polar column, temperature ramp

Column type | Active phase | I | Reference | Comment |
---|---|---|---|---|
Capillary | DB-1 | 1441. | Tohar, Mohd, et al., 2006 | 30. m/0.32 mm/0.25 μm, 60. C @ 3. min, 3. K/min, 230. C @ 10. min |

Normal alkane RI, non-polar column, custom temperature program

Column type | Active phase | I | Reference | Comment |
---|---|---|---|---|
Capillary | SE-30 | 1440. | Vinogradov, 2004 | Program: not specified |
Capillary | OV-101 | 1440. | Shibamoto, 1987 | Program: not specified |

Normal alkane RI, polar column, custom temperature program

Column type | Active phase | I | Reference | Comment |
---|---|---|---|---|
Capillary | Carbowax 20M | 1833. | Vinogradov, 2004 | Program: not specified |
Capillary | Carbowax 20M | 1833. | Shibamoto, 1987 | Program: not specified |

References

Aldrich Chemical Company Inc., 1990
Aldrich Chemical Company Inc.,
Catalog Handbook of Fine Chemicals, Aldrich Chemical Company, Inc., Milwaukee WI, 1990, 1. [all data]
Tohar, Mohd, et al., 2006
Tohar, N.; Mohd, M.A.; Jantan, I.; Awang, K.,
A comparative study of the essential oils of the genus Plumeria Linn. from Malaysia,
Flavour Fragr. J., 2006, 21, 6, 859-863, https://doi.org/10.1002/ffj.1617
. [all data]
Vinogradov, 2004
Vinogradov, B.A.,
Production, composition, properties and application of essential oils, 2004, retrieved from http://viness.narod.ru. [all data]
Shibamoto, 1987
Shibamoto, T.,
Retention Indices in Essential Oil Analysis
in Capillary Gas Chromatography in Essential Oil Analysis, Sandra, P.; Bicchi, C., ed(s)., Hutchig Verlag, Heidelberg, New York, 1987, 259-274. [all data]