Ethyl chrysanthemate
- Formula: C12H20O2
- Molecular weight: 196.2860
- IUPAC Standard InChIKey: VIMXTGUGWLAOFZ-UHFFFAOYSA-N
- CAS Registry Number: 97-41-6
- Chemical structure:
View 3d structure (requires JavaScript / HTML 5) - Other names: Cyclopropanecarboxylic acid, 2,2-dimethyl-3-(2-methyl-1-propenyl)-, ethyl ester; Cyclopropanecarboxylic acid, 2,2-dimethyl-3-(2-methylpropenyl)-, ethyl ester; Ethyl chrysanthemumate; Chrysanthemum-monocarboxlic acid ethyl ester; 2,2-Dimethyl-3-(2-methylpropenyl)cyclopropanecarboxylic acid ethyl ester; ethyl 2,2-dimethyl-3-(2-methylpropenyl)cyclopropanecarboxylate

Phase change data

Data compiled by: Robert L. Brown and Stephen E. Stein
Reduced pressure boiling point
Tboil (K) | Pressure (bar) | Reference |
---|---|---|
385.2 | 0.013 | Weast and Grasselli, 1989 |
391. to 393. | 0.020 | Frinton Laboratories Inc., 1986 |

References

Weast and Grasselli, 1989
CRC Handbook of Data on Organic Compounds, 2nd Editon, Weast,R.C and Grasselli, J.G., ed(s)., CRC Press, Inc., Boca Raton, FL, 1989, 1. [all data]
Frinton Laboratories Inc., 1986
Frinton Laboratories Inc.,
Catalog Number 11, Frinton Laboratories Inc., Vineland, NJ, 1986, 99. [all data]