isoeugenyl acetate 2
- Formula: C12H14O3
- Molecular weight: 206.2378
- IUPAC Standard InChIKey: IUSBVFZKQJGVEP-PLNGDYQASA-N
- CAS Registry Number: 97412-23-2
- Chemical structure:
View 3d structure (requires JavaScript / HTML 5) - Stereoisomers:
- Other names: (Z)-Isoeugenyl acetate; (Z)-Isoeugenol acetate

Kovats' RI, non-polar column, isothermal

Column type | Active phase | Temperature (C) | I | Reference | Comment |
---|---|---|---|---|---|
Capillary | SE-30 | 100. | 1581.2 | Tudor, 1997 | 40. m/0.35 mm/0.35 μm |

Van Den Dool and Kratz RI, non-polar column, temperature ramp

Column type | Active phase | I | Reference | Comment |
---|---|---|---|---|
Capillary | HP-5MS | 1565. | Benkaci-Ali, Baaliouamer, et al., 2007 | 30. m/0.25 mm/0.25 μm, He, 60. C @ 8. min, 2. K/min, 250. C @ 30. min |

Normal alkane RI, non-polar column, custom temperature program

Column type | Active phase | I | Reference | Comment |
---|---|---|---|---|
Capillary | HP-5 MS | 1566. | Setzer, Stokes, et al., 2007 | Helium; Column length: 30. m; Column diameter: 0.25 mm; Program: 40 0C (10 min) 3 oC/min -> 200 0C 2 0C/min -> 220 0C |

References

Tudor, 1997
Tudor, E.,
Temperature dependence of the retention index for perfumery compounds on a SE-30 glass capillary column. I. Linear equations,
J. Chromatogr. A, 1997, 779, 1-2, 287-297, https://doi.org/10.1016/S0021-9673(97)00453-6
. [all data]
Benkaci-Ali, Baaliouamer, et al., 2007
Benkaci-Ali, F.; Baaliouamer, A.; Meklati, B.Y.; Chemat, F.,
Chemical composition of seed essential oils from Algerian Nigella sativa extracted by microwave and hydrodistillation,
Flavour Fragr. J., 2007, 22, 2, 148-153, https://doi.org/10.1002/ffj.1773
. [all data]
Setzer, Stokes, et al., 2007
Setzer, W.N.; Stokes, S.L.; Penton, A.F.; Takaku, S.; Haber, W.A.; Hansell, E.; Caffrey, C.R.; McKerrow, J.H.,
Cruzain inhibitory activity of leaf essential oils of neotropical Lauraceae and essential oil components,
Natural Product Communications, 2007, 2, 12, 1203-1210. [all data]