Benzene, 1-chloro-2,4-dinitro-
- Formula: C6H3ClN2O4
- Molecular weight: 202.552
- IUPAC Standard InChIKey: VYZAHLCBVHPDDF-UHFFFAOYSA-N
- CAS Registry Number: 97-00-7
- Chemical structure:
View 3d structure (requires JavaScript / HTML 5) - Other names: Dinitrochlorobenzene; DNCB; 1-Chloro-2,4-dinitrobenzene; 1,3-Dinitro-4-chlorobenzene; 2,4-Dinitro-1-chlorobenzene; 2,4-Dinitrochlorobenzene; 2,4-Dinitrophenyl chloride; 4-Chloro-1,3-dinitrobenzene; 1-Chloor-2,4-dinitrobenzeen; 1-Chloro-2,4-dinitrobenzol; 1-Cloro-2,4-dinitrobenzene; CDNB; 1-Chlor-2,4-dinitrobenzene; 6-Chloro-1,3-dinitrobenzene; Dinitrochlorobenzol; NSC 6292

Phase change data

Data compiled as indicated in comments:
BS - Robert L. Brown and Stephen E. Stein
AC - William E. Acree, Jr., James S. Chickos
Quantity | Value | Units | Method | Reference | Comment |
---|---|---|---|---|---|
Tboil | 588.2 | K | N/A | Weast and Grasselli, 1989 | BS |
Enthalpy of vaporization
ΔvapH (kJ/mol) | Temperature (K) | Method | Reference | Comment |
---|---|---|---|---|
80.5 | 445. | A | Stephenson and Malanowski, 1987 | Based on data from 430. to 590. K.; AC |
Enthalpy of fusion
ΔfusH (kJ/mol) | Temperature (K) | Reference | Comment |
---|---|---|---|
20.17 | 325.2 | Kubota, 1932 | AC |

References

Weast and Grasselli, 1989
CRC Handbook of Data on Organic Compounds, 2nd Editon, Weast,R.C and Grasselli, J.G., ed(s)., CRC Press, Inc., Boca Raton, FL, 1989, 1. [all data]
Stephenson and Malanowski, 1987
Stephenson, Richard M.; Malanowski, Stanislaw,
Handbook of the Thermodynamics of Organic Compounds, 1987, https://doi.org/10.1007/978-94-009-3173-2
. [all data]
Kubota, 1932
Kubota, T.,
J. Chem. Soc. Jpn., 1932, 53, 404. [all data]
Lang (editor), 1965
Lang (editor), L.,
Absorption Spectra in the Ultraviolet and Visible Region, 1965, 5, 211. [all data]