1,4-Benzenediol, 2-methyl-
- Formula: C7H8O2
- Molecular weight: 124.1372
- IUPAC Standard InChIKey: CNHDIAIOKMXOLK-UHFFFAOYSA-N
- CAS Registry Number: 96937-50-7
- Chemical structure:
View 3d structure (requires JavaScript / HTML 5) - Species with the same structure:
- Other names: Hydroquinone, methyl-; p-Toluhydroquinol; p-Toluhydroquinone; p-Toluquinol; Methyl-p-hydroquinone; Methylhydroquinone; Toluhydroquinone; Toluquinol; Tolylhydroquinone; THQ; 2-Methyl-1,4-Benzenediol; 2-Methylhydroquinone; 2,5-Dihydroxytoluene; 1,4-Dihydroxy-2-methylbenzene; 2,5-Toluenediol; 2-Methyl-p-hydroquinone; 2-Methyl-1,4-hydroquinone; NSC 4962; 2-Methyl-1,4-benzenediol (2-methylhydroquinone)

Condensed phase thermochemistry data

Data compiled by: Hussein Y. Afeefy, Joel F. Liebman, and Stephen E. Stein
Quantity | Value | Units | Method | Reference | Comment |
---|---|---|---|---|---|
ΔcH°solid | -835.2 | kcal/mol | Ccb | Swietoslawski and Starczewska, 1928 | Heat of combustion corrected for constant pressure; Corresponding ΔfHºsolid = -96.4 kcal/mol (simple calculation by NIST; no Washburn corrections) |

References

Swietoslawski and Starczewska, 1928
Swietoslawski, W.; Starczewska, H.,
Influence of certain corrections on the results of measurements of the heat of combustion of organic substances,
Bull. Int. Acad. Pol. Sci. Lett. Cl. Med., 1928, 85-97. [all data]