Tricyclopenta[bc,hi,no]coronene
- Formula: C30H12
- Molecular weight: 372.4163
- IUPAC Standard InChIKey: XKRUUBUTJLQZHB-UHFFFAOYSA-N
- CAS Registry Number: 96928-77-7
- Chemical structure:
View 3d structure (requires JavaScript / HTML 5) - Permanent link for this species. Use this link for bookmarking this species for future reference.

Gas phase thermochemistry data

Data compiled by: Glushko Thermocenter, Russian Academy of Sciences, Moscow
Constant pressure heat capacity of gas
Cp,gas (J/mol*K) | Temperature (K) | Reference | Comment |
---|---|---|---|
50.17 | 50. | Dorofeeva O.V., 1989 | These statistically calculated values were obtained using force field approximation for polycyclic aromatic hydrocarbons to estimate the needed vibrational frequencies (see also [ Dorofeeva O.V., 1986, Moiseeva N.F., 1990]). These functions are reproduced in the reference book [ Frenkel M., 1994]. |
94.09 | 100. | ||
151.14 | 150. | ||
214.53 | 200. | ||
309.92 | 273.15 | ||
341.8 ± 8.0 | 298.15 | ||
344.09 | 300. | ||
461.41 | 400. | ||
558.61 | 500. | ||
636.08 | 600. | ||
697.45 | 700. | ||
746.45 | 800. | ||
786.05 | 900. | ||
818.42 | 1000. | ||
845.18 | 1100. | ||
867.49 | 1200. | ||
886.25 | 1300. | ||
902.13 | 1400. | ||
915.67 | 1500. |

References

Dorofeeva O.V., 1989
Dorofeeva O.V.,
Thermodynamic Properties of Gaseous Polycyclic Aromatic Hydrocarbons Containing Five-Membered Rings. Institute for High Temperatures, USSR Academy of Sciences, Preprint No.1-263 (in Russian), Moscow, 1989. [all data]
Dorofeeva O.V., 1986
Dorofeeva O.V.,
On calculation of thermodynamic properties of polycyclic aromatic hydrocarbons,
Thermochim. Acta, 1986, 102, 59-66. [all data]
Moiseeva N.F., 1990
Moiseeva N.F.,
Group additivity scheme for calculating the chemical thermodynamic properties of gaseous polycyclic aromatic hydrocarbons containing five-membered rings,
Thermochim. Acta, 1990, 168, 179-186. [all data]
Frenkel M., 1994
Frenkel M.,
Thermodynamics of Organic Compounds in the Gas State, Vol. I, II, Thermodynamics Research Center, College Station, Texas, 1994, 1994. [all data]