9-Octadecenoic acid, (E)-, TMS derivative
- Formula: C21H42O2Si
- Molecular weight: 354.6425
- IUPAC Standard InChIKey: GAODWSYPSJBKGB-OUKQBFOZSA-N
- CAS Registry Number: 96851-47-7
- Chemical structure:
View 3d structure (requires JavaScript / HTML 5) - Stereoisomers:
- Other names: trans-9-Octadecenoic acid, trimethylsilyl ester; Trimethylsilyl (9E)-9-octadecenoate; TMS trans-9-octadecenoate; (E)-9-Octadecenoic acid, TMS ester; trans-9-Octadecenoic acid, TMS

Van Den Dool and Kratz RI, non-polar column, temperature ramp

Column type | Active phase | I | Reference | Comment |
---|---|---|---|---|
Capillary | Ultra-1 | 2215.05 | Richmond and Pombo-Villar, 1997 | 25. m/0.32 mm/0.52 μm, 15. K/min, 320. C @ 10. min; Tstart: 35. C |

Van Den Dool and Kratz RI, non-polar column, custom temperature program

Column type | Active phase | I | Reference | Comment |
---|---|---|---|---|
Capillary | VF-5MS | 2217.7 | Tret'yakov, 2007 | 30. m/0.25 mm/0.25 μm, He; Program: Multi-step temperature program; T(initial)=60C; T(final)=270C |

Normal alkane RI, non-polar column, temperature ramp

Column type | Active phase | I | Reference | Comment |
---|---|---|---|---|
Capillary | HP-5 | 2227. | Isidorov, Lech, et al., 2008 | 30. m/0.25 mm/0.25 μm, Helium, 3. K/min, 300. C @ 30. min; Tstart: 50. C |

References

Richmond and Pombo-Villar, 1997
Richmond, R.; Pombo-Villar, E.,
Short communication. Gas chromatography-mass spectrometry coupled with pseudo-Sadtler retention indices, for the identification of components in the essential oil of Curcuma longa L.,
J. Chromatogr. A, 1997, 760, 2, 303-308, https://doi.org/10.1016/S0021-9673(96)00802-3
. [all data]
Tret'yakov, 2007
Tret'yakov, K.V.,
Retention Data. NIST Mass Spectrometry Data Center., NIST Mass Spectrometry Data Center, 2007. [all data]
Isidorov, Lech, et al., 2008
Isidorov, V.A.; Lech, P.; Zolciak, A.; Rusak, N.; Szczepaniak, L.,
Gas Chromatographic - nass spectrometric investigation of metabolites from the needles and roots of pine seedlings at early stages of pathogenic fungi Armillaria ostoyae attack,
Trees, 2008, 22, 4, 531-542, https://doi.org/10.1007/s00468-008-0213-z
. [all data]