L-Valine, N-acetyl-
- Formula: C7H13NO3
- Molecular weight: 159.1830
- IUPAC Standard InChIKey: IHYJTAOFMMMOPX-LURJTMIESA-N
- CAS Registry Number: 96-81-1
- Chemical structure:
View 3d structure (requires JavaScript / HTML 5) - Other names: Valine, N-acetyl-, L-; Acetylvaline; N-Acetyl-L-valine; N-Acetylvaline

Reaction thermochemistry data

Data compiled by: Robert C. Dunbar
Individual Reactions
By formula: Na+ + C7H13NO3 = (Na+ • C7H13NO3)
Free energy of reaction
ΔrG° (kJ/mol) | T (K) | Method | Reference |
---|---|---|---|
140. | 0. | CIDC | Feng, Gronert, et al., 1999 |

Ion clustering data

Data compiled by: Robert C. Dunbar
Clustering reactions
By formula: Na+ + C7H13NO3 = (Na+ • C7H13NO3)
Free energy of reaction
ΔrG° (kJ/mol) | T (K) | Method | Reference |
---|---|---|---|
140. | 0. | CIDC | Feng, Gronert, et al., 1999 |

References

Feng, Gronert, et al., 1999
Feng, W.Y.; Gronert, S.; Lebrilla, C.B.,
Lithium and sodium ion binding energies of N-acetyl and N-glycyl amino acids,
J. Am. Chem. Soc., 1999, 121, 6, 1365, https://doi.org/10.1021/ja983116s
. [all data]