(Diisopropylamino)ethanol
- Formula: C8H19NO
- Molecular weight: 145.2426
- IUPAC Standard InChIKey: ZYWUVGFIXPNBDL-UHFFFAOYSA-N
- CAS Registry Number: 96-80-0
- Chemical structure:

Phase change data

Data compiled as indicated in comments:
BS - Robert L. Brown and Stephen E. Stein
TRC - Thermodynamics Research Center, NIST Boulder Laboratories, Chris Muzny director
Quantity | Value | Units | Method | Reference | Comment |
---|---|---|---|---|---|
Tboil | 463.2 | K | N/A | Weast and Grasselli, 1989 | BS |
Quantity | Value | Units | Method | Reference | Comment |
Tfus | 233.9 | K | N/A | Anonymous, 1952 | Uncertainty assigned by TRC = 0.6 K; TRC |

References

Weast and Grasselli, 1989
CRC Handbook of Data on Organic Compounds, 2nd Editon, Weast,R.C and Grasselli, J.G., ed(s)., CRC Press, Inc., Boca Raton, FL, 1989, 1. [all data]
Anonymous, 1952
Anonymous, R.,
, Physical Properties of Chemical Substances, Dow Chemical Co., 1952. [all data]