Perfluoro(methylcyclohexane) anion
- Formula: C7F14-
- Molecular weight: 350.0531
- IUPAC Standard InChIKey: YDPCVPKIVXXFRR-UHFFFAOYSA-N
- CAS Registry Number: 96759-86-3
- Chemical structure:
View 3d structure (requires JavaScript / HTML 5) - Permanent link for this species. Use this link for bookmarking this species for future reference.

Gas phase thermochemistry data

Data compiled by: John E. Bartmess
Quantity | Value | Units | Method | Reference | Comment |
---|---|---|---|---|---|
ΔfH°gas | -3000. ± 13. | kJ/mol | R-EA | Grimsrud, Chowdhury, et al., 1985 | ΔGea(423 K) = -26.1 kcal/mol; ΔSea = -2.7 eu. |

Reaction thermochemistry data

Data compiled as indicated in comments:
M - Michael M. Meot-Ner (Mautner) and Sharon G. Lias
B - John E. Bartmess
Individual Reactions
By formula: C7F14- + C6H5NO2 = (C7F14- • C6H5NO2)
Free energy of reaction
ΔrG° (kJ/mol) | T (K) | Method | Reference | Comment |
---|---|---|---|---|
28. | 300. | PHPMS | Chowdhury and Kebarle, 1986 | gas phase; M |
By formula: C7F14- + CH4O = (C7F14- • CH4O)
Free energy of reaction
ΔrG° (kJ/mol) | T (K) | Method | Reference | Comment |
---|---|---|---|---|
27. | 308. | PHPMS | Knighton, Zook, et al., 1990 | gas phase; M |
By formula: C7F14- + C2H6OS = (C7F14- • C2H6OS)
Free energy of reaction
ΔrG° (kJ/mol) | T (K) | Method | Reference | Comment |
---|---|---|---|---|
32. | 308. | PHPMS | Knighton, Zook, et al., 1990 | gas phase; M |
+
= C13H5F14NO2-
By formula: C7F14- + C6H5NO2 = C13H5F14NO2-
Quantity | Value | Units | Method | Reference | Comment |
---|---|---|---|---|---|
ΔrG° | 28. ± 4.2 | kJ/mol | IMRE | Chowdhury and Kebarle, 1986 | gas phase; B |

Ion clustering data

Data compiled as indicated in comments:
M - Michael M. Meot-Ner (Mautner) and Sharon G. Lias
B - John E. Bartmess
Clustering reactions
By formula: C7F14- + CH4O = (C7F14- • CH4O)
Free energy of reaction
ΔrG° (kJ/mol) | T (K) | Method | Reference | Comment |
---|---|---|---|---|
27. | 308. | PHPMS | Knighton, Zook, et al., 1990 | gas phase; M |
By formula: C7F14- + C2H6OS = (C7F14- • C2H6OS)
Free energy of reaction
ΔrG° (kJ/mol) | T (K) | Method | Reference | Comment |
---|---|---|---|---|
32. | 308. | PHPMS | Knighton, Zook, et al., 1990 | gas phase; M |
By formula: C7F14- + C6H5NO2 = (C7F14- • C6H5NO2)
Free energy of reaction
ΔrG° (kJ/mol) | T (K) | Method | Reference | Comment |
---|---|---|---|---|
28. | 300. | PHPMS | Chowdhury and Kebarle, 1986 | gas phase; M |
+
= C13H5F14NO2-
By formula: C7F14- + C6H5NO2 = C13H5F14NO2-
Quantity | Value | Units | Method | Reference | Comment |
---|---|---|---|---|---|
ΔrG° | 28. ± 4.2 | kJ/mol | IMRE | Chowdhury and Kebarle, 1986 | gas phase; B |

References

Grimsrud, Chowdhury, et al., 1985
Grimsrud, E.P.; Chowdhury, S.; Kebarle, P.,
Electron affinity of SF6 and perfluoromethylcyclohexane. The unusual kinetics of electron transfer reactions A- + B- + A, where A = SF6 or perfluorinated cycloalkanes,
J. Chem. Phys., 1985, 83, 1059. [all data]
Chowdhury and Kebarle, 1986
Chowdhury, S.; Kebarle, P.,
Role of Binding Energies in A-.B and A.B- Complexes in the Kinetics of Gas Phase Electron Transfer Reactions:A- + B = A + B- Involving Perfluoro Compounds: SF6, C6F11CF3,
J. Chem. Phys., 1986, 85, 9, 4989, https://doi.org/10.1063/1.451687
. [all data]
Knighton, Zook, et al., 1990
Knighton, W.B.; Zook, D.R.; Grimsrud, E.P.,
Cluster-Assisted Decomposition Reactions of the Molecular Anions of SF6 and C7F14,
J. Am. Soc. Mass Spectrom., 1990, 1, 5, 372, https://doi.org/10.1016/1044-0305(90)85017-G
. [all data]