Thiophene, 2-chloro-
- Formula: C4H3ClS
- Molecular weight: 118.585
- IUPAC Standard InChIKey: GSFNQBFZFXUTBN-UHFFFAOYSA-N
- CAS Registry Number: 96-43-5
- Chemical structure:
View 3d structure (requires JavaScript / HTML 5) - Other names: 2-Chlorothiophene; 2-Thienyl chloride

Condensed phase thermochemistry data

Data compiled by: Eugene S. Domalski and Elizabeth D. Hearing
Quantity | Value | Units | Method | Reference | Comment |
---|---|---|---|---|---|
S°liquid | 209.11 | J/mol*K | N/A | Fujimori and Oguni, 1993 |
Constant pressure heat capacity of liquid
Cp,liquid (J/mol*K) | Temperature (K) | Reference | Comment |
---|---|---|---|
139.43 | 298.15 | Fujimori and Oguni, 1993 | T = 5 to 300 K. |

Phase change data

Data compiled as indicated in comments:
BS - Robert L. Brown and Stephen E. Stein
TRC - Thermodynamics Research Center, NIST Boulder Laboratories, Chris Muzny director
AC - William E. Acree, Jr., James S. Chickos
DH - Eugene S. Domalski and Elizabeth D. Hearing
Quantity | Value | Units | Method | Reference | Comment |
---|---|---|---|---|---|
Tboil | 401.5 | K | N/A | Weast and Grasselli, 1989 | BS |
Tboil | 401.65 | K | N/A | Khodeir, Skulski, et al., 1986 | Uncertainty assigned by TRC = 1.5 K; TRC |
Tboil | 465.65 | K | N/A | Khodeir, Skulski, et al., 1986 | Uncertainty assigned by TRC = 1.5 K; TRC |
Quantity | Value | Units | Method | Reference | Comment |
Ttriple | 201. | K | N/A | Fujimori and Oguni, 1993, 2 | Uncertainty assigned by TRC = 0.1 K; TRC |
Enthalpy of vaporization
ΔvapH (kJ/mol) | Temperature (K) | Method | Reference | Comment |
---|---|---|---|---|
34.7 | 328. | N/A | Dykyj, Svoboda, et al., 1999 | Based on data from 313. to 401. K.; AC |
36.9 | 335. | N/A | Dykyj, Svoboda, et al., 1999 | Based on data from 320. to 401. K. See also Ditsent, Skorokhodov, et al., 1981.; AC |
34.4 | 348. | A,I | Stephenson and Malanowski, 1987 | Based on data from 333. to 374. K. See also Eon, Pommier, et al., 1971 and Dykyj, Svoboda, et al., 1999.; AC |
Antoine Equation Parameters
log10(P) = A − (B / (T + C))
P = vapor pressure (bar)
T = temperature (K)
View plot Requires a JavaScript / HTML 5 canvas capable browser.
Temperature (K) | A | B | C | Reference | Comment |
---|---|---|---|---|---|
333.4 to 373.5 | 4.52796 | 1792.85 | -0.598 | Eon, Pommier, et al., 1971 | Coefficents calculated by NIST from author's data. |
Enthalpy of fusion
ΔfusH (kJ/mol) | Temperature (K) | Reference | Comment |
---|---|---|---|
8.966 | 201.30 | Fujimori and Oguni, 1993 | DH |
8.97 | 201.3 | Fujimori and Oguni, 1993, 3 | AC |
Entropy of fusion
ΔfusS (J/mol*K) | Temperature (K) | Reference | Comment |
---|---|---|---|
44.54 | 201.30 | Fujimori and Oguni, 1993 | DH |

Gas phase ion energetics data

Data evaluated as indicated in comments:
L - Sharon G. Lias
Data compiled as indicated in comments:
LL - Sharon G. Lias and Joel F. Liebman
LLK - Sharon G. Lias, Rhoda D. Levin, and Sherif A. Kafafi
RDSH - Henry M. Rosenstock, Keith Draxl, Bruce W. Steiner, and John T. Herron
Quantity | Value | Units | Method | Reference | Comment |
---|---|---|---|---|---|
IE (evaluated) | 8.74 ± 0.04 | eV | N/A | N/A | L |
Ionization energy determinations
IE (eV) | Method | Reference | Comment |
---|---|---|---|
8.78 | PE | Veszpremi, Nyulaszi, et al., 1988 | LL |
8.83 | CTS | Aloisi and Pignataro, 1973 | LLK |
9.06 ± 0.05 | EI | Linda, Marino, et al., 1971 | LLK |
8.70 ± 0.05 | PE | Baker, Betteridge, et al., 1970 | RDSH |
8.68 ± 0.01 | PI | Watanabe, 1957 | RDSH |
8.89 ± 0.05 | PE | Fringuelli, Marino, et al., 1976 | Vertical value; LLK |

References

Fujimori and Oguni, 1993
Fujimori, H.; Oguni, M.,
Thermodynamic study of 2-chlorothiophene: observation of two subsequent glass transitions in the stable crystalline state,
J. Phys. Chem. Solids, 1993, 54(5), 607-612. [all data]
Weast and Grasselli, 1989
CRC Handbook of Data on Organic Compounds, 2nd Editon, Weast,R.C and Grasselli, J.G., ed(s)., CRC Press, Inc., Boca Raton, FL, 1989, 1. [all data]
Khodeir, Skulski, et al., 1986
Khodeir, N.M.; Skulski, L.; Wroczynski, P.,
Preparation of 2-Chlorofuran and 2-Chlorothiophene from the Respective Furan and Thiophene Mercurials and Disulfur Dichloride,
Bull. Pol. Acad. Sci., Chem., 1986, 34, 443. [all data]
Fujimori and Oguni, 1993, 2
Fujimori, H.; Oguni, M.,
Construction of an adiabatic calorimeter at low-temp and glass transition of crystalline 2-bromothiophene,
J. Phys. Chem. Solids, 1993, 54, 271. [all data]
Dykyj, Svoboda, et al., 1999
Dykyj, J.; Svoboda, J.; Wilhoit, R.C.; Frenkel, M.L.; Hall, K.R.,
Vapor Pressure of Chemicals: Part A. Vapor Pressure and Antoine Constants for Hydrocarbons and Sulfur, Selenium, Tellurium and Hydrogen Containing Organic Compounds, Springer, Berlin, 1999, 373. [all data]
Ditsent, Skorokhodov, et al., 1981
Ditsent, V.E.; Skorokhodov, I.I.; Zolotareva, M.N.; Savuskina, V.I.; Tabenko, B.N.,
Zh. Prikl. Khim. (Leningrad), 1981, 54, 1617. [all data]
Stephenson and Malanowski, 1987
Stephenson, Richard M.; Malanowski, Stanislaw,
Handbook of the Thermodynamics of Organic Compounds, 1987, https://doi.org/10.1007/978-94-009-3173-2
. [all data]
Eon, Pommier, et al., 1971
Eon, C.; Pommier, C.; Guiochon, G.,
Vapor pressures and second virial coefficients of some five-membered heterocyclic derivatives,
J. Chem. Eng. Data, 1971, 16, 4, 408-410, https://doi.org/10.1021/je60051a008
. [all data]
Fujimori and Oguni, 1993, 3
Fujimori, H.; Oguni, M.,
Construction of an adiabatic calorimeter at low temperatures and glass transition of crystalline 2-bromothiophene,
J. Phys. Chem. Solids, 1993, 54(2), 271-280. [all data]