Androst-2-en-17-one, (5α)-
- Formula: C19H28O
- Molecular weight: 272.4250
- IUPAC Standard InChIKey: ISJVDMWNISUFRJ-IHFGAHDLSA-N
- CAS Registry Number: 963-75-7
- Chemical structure:

Kovats' RI, non-polar column, temperature ramp

Column type | Active phase | I | Reference | Comment |
---|---|---|---|---|
Packed | SE-30 | 2240. | Maurer, 1990 | N2, 100. C @ 3. min, 30. K/min, 310. C @ 5. min |
Capillary | Methyl Silicone | 2240. | Maurer and Pfleger, 1988 | 12. m/0.20 mm/0.33 μm, He, 100. C @ 3. min, 30. K/min, 310. C @ 5. min |

References

Maurer, 1990
Maurer, H.H.,
Identification and differentiation of barbiturates, other sedative-hypnotics and their metabolites in urine integrated in a general screening procedure using computerized gas chromatography-mass spectrometry,
J. Chromatogr., 1990, 530, 307-326, https://doi.org/10.1016/S0378-4347(00)82334-8
. [all data]
Maurer and Pfleger, 1988
Maurer, H.; Pfleger, K.,
Identification and Differentiation of Alkylamine Antihistamines and Their Metabolites in Urine by Computerized Gas Chromatography-Mass Spectrometry,
J. Chromatogr., 1988, 430, 31-41, https://doi.org/10.1016/S0378-4347(00)83131-X
. [all data]