2-Chloro-N-methylacetamide
- Formula: C3H6ClNO
- Molecular weight: 107.539
- IUPAC Standard InChIKey: HOZLOOPIXHWKCI-UHFFFAOYSA-N
- CAS Registry Number: 96-30-0
- Chemical structure:
View 3d structure (requires JavaScript / HTML 5) - Other names: Acetamide, 2-chloro-N-methyl-; N-Methyl-2-chloroacetamide; N-Methylchloroacetamide; USAF DO-35; α-Chloro-N-methylacetamide; ClCON(CH3)2

Phase change data

Data compiled by: Robert L. Brown and Stephen E. Stein
Reduced pressure boiling point
Tboil (K) | Pressure (bar) | Reference |
---|---|---|
385. to 388. | 0.027 | Frinton Laboratories Inc., 1986 |

Gas phase ion energetics data

Data evaluated by: Edward P. Hunter and Sharon G. Lias
Quantity | Value | Units | Method | Reference | Comment |
---|---|---|---|---|---|
Proton affinity (review) | 845.8 | kJ/mol | N/A | Hunter and Lias, 1998 | |
Quantity | Value | Units | Method | Reference | Comment |
Gas basicity | 814.8 | kJ/mol | N/A | Hunter and Lias, 1998 |

References

Frinton Laboratories Inc., 1986
Frinton Laboratories Inc.,
Catalog Number 11, Frinton Laboratories Inc., Vineland, NJ, 1986, 99. [all data]
Hunter and Lias, 1998
Hunter, E.P.; Lias, S.G.,
Evaluated Gas Phase Basicities and Proton Affinities of Molecules: An Update,
J. Phys. Chem. Ref. Data, 1998, 27, 3, 413-656, https://doi.org/10.1063/1.556018
. [all data]