2-Butanone, oxime

Phase change data

Data compiled as indicated in comments:
BS - Robert L. Brown and Stephen E. Stein
TRC - Thermodynamics Research Center, NIST Boulder Laboratories, Chris Muzny director
AC - William E. Acree, Jr., James S. Chickos

Quantity Value Units Method Reference Comment
Tboil425.7KN/AWeast and Grasselli, 1989BS
Quantity Value Units Method Reference Comment
Tfus243.65KN/ATimmermans and Mattaar, 1921Uncertainty assigned by TRC = 0.5 K; TRC
Quantity Value Units Method Reference Comment
Δvap59.1 ± 0.2kJ/molGSVerevkin, Emel'yanenko, et al., 2009Based on data from 283. - 329. K.; AC
Δvap57.7kJ/molN/AMessow, B«65533»r, et al., 1975Based on data from 313. - 333. K. See also Verevkin, Emel'yanenko, et al., 2009.; AC

Reduced pressure boiling point

Tboil (K) Pressure (bar) Reference Comment
332.70.020Weast and Grasselli, 1989BS

Enthalpy of vaporization

ΔvapH (kJ/mol) Temperature (K) Method Reference Comment
58.6 ± 0.2306.GSVerevkin, Emel'yanenko, et al., 2009Based on data from 283. - 329. K.; AC
53.7323.AStephenson and Malanowski, 1987Based on data from 308. - 425. K.; AC
55.5330.AStephenson and Malanowski, 1987Based on data from 318. - 343. K.; AC
57.2323.N/AMessow, B«65533»r, et al., 1975Based on data from 313. - 333. K. See also Verevkin, Emel'yanenko, et al., 2009.; AC

In addition to the Thermodynamics Research Center (TRC) data available from this site, much more physical and chemical property data is available from the following TRC products:

Condensed phase thermochemistry data

Data compiled by: Hussein Y. Afeefy, Joel F. Liebman, and Stephen E. Stein

Quantity Value Units Method Reference Comment
Δfsolid-151.kJ/molCcbLandrieu, 1905
Quantity Value Units Method Reference Comment
Δcsolid-2727.kJ/molCcbLandrieu, 1905

References

Weast and Grasselli, 1989
CRC Handbook of Data on Organic Compounds, 2nd Editon, Weast,R.C and Grasselli, J.G., ed(s)., CRC Press, Inc., Boca Raton, FL, 1989, 1. [all data]

Timmermans and Mattaar, 1921
Timmermans, J.; Mattaar, J.F., Freezing points of orgainic substances VI. New experimental determinations., Bull. Soc. Chim. Belg., 1921, 30, 213. [all data]

Verevkin, Emel'yanenko, et al., 2009
Verevkin, Sergey P.; Emel'yanenko, Vladimir N.; Toktonov, Alexey V.; Goodrich, Peter; Hardacre, Christopher, Thermochemistry of Ionic Liquid-Catalyzed Reactions: Theoretical and Experimental Study of the Beckmann Rearrangement---Kinetic or Thermodynamic Control? «8224», Ind. Eng. Chem. Res., 2009, 48, 22, 9809-9816, https://doi.org/10.1021/ie900633r . [all data]

Messow, B«65533»r, et al., 1975
Messow, U.; B«65533»r, J.; Quitzsch, K.; Geiseler, G., Isotherme Dampfdruckmessungen an bin«65533»ren Oximgemischen, J. Prakt. Chem., 1975, 317, 1, 114-122, https://doi.org/10.1002/prac.19753170113 . [all data]

Stephenson and Malanowski, 1987
Stephenson, Richard M.; Malanowski, Stanislaw, Handbook of the Thermodynamics of Organic Compounds, 1987, https://doi.org/10.1007/978-94-009-3173-2 . [all data]