Propane, 1,2-dibromo-3-chloro-
- Formula: C3H5Br2Cl
- Molecular weight: 236.333
- IUPAC Standard InChIKey: WBEJYOJJBDISQU-UHFFFAOYSA-N
- CAS Registry Number: 96-12-8
- Chemical structure:
View 3d structure (requires JavaScript / HTML 5) - Other names: 3-Chloro-1,2-dibromopropane; DBCP; Fumazone; Nemafume; Nemagon; Nemagon Soil Fumigant; Nemagon 20; Nemagon 20G; Nemagon 90; Nemapaz; Nemazon; OS 1897; 1,2-Dibromo-3-Chloropropane; Dibromochloropropane; ClCH2CHBrCH2Br; BBC 12; Dibromchlorpropan; Fumagon; Fumazone 86; Fumazone 86E; Nemabrom; Nemanax; Nemaset; NCI-C00500; Propane, 1-chloro-2,3-dibromo-; SD 1897; 1-Chloro-2,3-dibromopropane; 1,2-Dibrom-3-chlor-propan; 1,2-Dibromo-3-cloro-propano; 1,2-Dibroom-3-chloorpropaan; 1,2-dibromo-3-chloropropane (DBCP); NSC 1512

Kovats' RI, non-polar column, isothermal

Column type | Active phase | Temperature (C) | I | Reference | Comment |
---|---|---|---|---|---|
Capillary | DB-5 | 100. | 1089.72 | Harangi, 2003 | 60. m/0.32 mm/1. μm, He |
Capillary | DB-5 | 120. | 1100.14 | Harangi, 2003 | 60. m/0.32 mm/1. μm, He |

Van Den Dool and Kratz RI, non-polar column, temperature ramp

Column type | Active phase | I | Reference | Comment |
---|---|---|---|---|
Capillary | DB-5 | 1092.41 | Harangi, 2003 | 60. m/0.32 mm/1. μm, He, 60. C @ 2.8 min, 3. K/min; Tend: 180. C |
Capillary | DB-5 | 1095.64 | Harangi, 2003 | 60. m/0.32 mm/1. μm, He, 60. C @ 2.8 min, 4. K/min; Tend: 180. C |
Capillary | DB-1 | 1033.9 | Sun and Stremple, 2003 | 30. m/0.25 mm/0.25 μm, He, 3. K/min; Tstart: 40. C; Tend: 325. C |

Normal alkane RI, non-polar column, custom temperature program

Column type | Active phase | I | Reference | Comment |
---|---|---|---|---|
Capillary | Ultra-1 | 1036. | Tameo and Kiyos, 1991 | Program: not specified |
Capillary | OV-1, SE-30, Methyl silicone, SP-2100, OV-101, DB-1, etc. | 1063. | Waggott and Davies, 1984 | Hydrogen; Column length: 50. m; Column diameter: 0.32 mm; Program: not specified |

Normal alkane RI, polar column, custom temperature program

Column type | Active phase | I | Reference | Comment |
---|---|---|---|---|
Capillary | Carbowax 20M | 1657. | Tameo and Kiyos, 1991 | Program: not specified |

References

Harangi, 2003
Harangi, J.,
Short communication. Retention index calculation without n-alkanes -- the virtual carbon number,
J. Chromatogr. A, 2003, 993, 1-2, 187-195, https://doi.org/10.1016/S0021-9673(03)00320-0
. [all data]
Sun and Stremple, 2003
Sun, G.; Stremple, P.,
Retention index characterization of flavor, fragrance, and many other compounds on DB-1 and DB-XLB, 2003, retrieved from http://www.chem.agilent.com/cag/cabu/pdf/b-0279.pdf. [all data]
Tameo and Kiyos, 1991
Tameo, O.; Kiyos, I.,
Simultaneous determination of pesticides by capillary gas chromatography,
Cannot be traslated (in Japan), 1991, 14, 2, 109-122. [all data]
Waggott and Davies, 1984
Waggott, A.; Davies, I.W.,
Identification of organic pollutants using linear temperature programmed retention indices (LTPRIs) - Part II, 1984, retrieved from http://dwi.defra.gov.uk/research/completed-research/reports/dwi0383.pdf. [all data]