Aluminum, chlorodiethyl-
- Formula: C4H10AlCl
- Molecular weight: 120.557
- IUPAC Standard InChIKey: YNLAOSYQHBDIKW-UHFFFAOYSA-M
- CAS Registry Number: 96-10-6
- Chemical structure:
View 3d structure (requires JavaScript / HTML 5) - Other names: Chlorodiethylaluminum; Diethylaluminum chloride; Diethylaluminum monochloride; Diethylchloroaluminum; Diethylaluminium chloride; UN 1101

Condensed phase thermochemistry data

Data compiled by: José A. Martinho Simões
Quantity | Value | Units | Method | Reference | Comment |
---|---|---|---|---|---|
ΔfH°liquid | -382.2 ± 3.5 | kJ/mol | Review | Martinho Simões | Selected data. The enthalpy of formation relies on -187.3 ± 5.1 kJ/mol for the enthalpy of formation of Al(Et)3(l). |
ΔfH°liquid | -423.1 ± 3.6 | kJ/mol | Review | Martinho Simões | |
ΔfH°liquid | -237.8 ± 3.0 | kJ/mol | Review | Martinho Simões | |
Quantity | Value | Units | Method | Reference | Comment |
ΔcH°liquid | -3627.5 ± 2.9 | kJ/mol | CC-SB | Pawlenko, 1969 | The enthalpy of combustion was corrected according to the method used in Pawlenko, 1969. |

Phase change data

Data compiled as indicated in comments:
AC - William E. Acree, Jr., James S. Chickos
Enthalpy of vaporization
ΔvapH (kJ/mol) | Temperature (K) | Reference | Comment |
---|---|---|---|
50.5 | 293. | Buchan, Potemski, et al., 1991 | Based on data from 278. to 318. K.; AC |
53.9 | 373. | Buchan, Potemski, et al., 1991 | Based on data from 273. to 473. K.; AC |
Antoine Equation Parameters
log10(P) = A − (B / (T + C))
P = vapor pressure (bar)
T = temperature (K)
View plot Requires a JavaScript / HTML 5 canvas capable browser.
Temperature (K) | A | B | C | Reference | Comment |
---|---|---|---|---|---|
317. to 398. | 5.79595 | 2812.31 | 5.258 | Fic and Dvorak, 1965 | Coefficents calculated by NIST from author's data. |

Reaction thermochemistry data

Data compiled by: José A. Martinho Simões
Individual Reactions
2 (g) +
(l) = AlCl3 (cr) + 2
(g)
By formula: 2HCl (g) + C4H10AlCl (l) = AlCl3 (cr) + 2C2H6 (g)
Quantity | Value | Units | Method | Reference | Comment |
---|---|---|---|---|---|
ΔrH° | -265.0 ± 3.3 | kJ/mol | RSC | Shaulov and Shmyreva, 1968 | The reaction enthalpy was derived from data in Shaulov and Shmyreva, 1968. |
AlCl3 (cr) + 2 (l) = 3
(l)
By formula: AlCl3 (cr) + 2C6H15Al (l) = 3C4H10AlCl (l)
Quantity | Value | Units | Method | Reference | Comment |
---|---|---|---|---|---|
ΔrH° | -66.8 ± 1.3 | kJ/mol | RSC | Smith, 1974 | Please also see Pedley and Rylance, 1977. |
(l) +
(l) = C6H15Al2Cl3 (l)
By formula: C2H5AlCl2 (l) + C4H10AlCl (l) = C6H15Al2Cl3 (l)
Quantity | Value | Units | Method | Reference | Comment |
---|---|---|---|---|---|
ΔrH° | -2.3 ± 0.2 | kJ/mol | RSC | Smith, 1974 | Please also see Pedley and Rylance, 1977. |
By formula: C2H5AlCl2 (l) + C6H15Al (l) = 2C4H10AlCl (l)
Quantity | Value | Units | Method | Reference | Comment |
---|---|---|---|---|---|
ΔrH° | -39.5 ± 0.8 | kJ/mol | RSC | Smith, 1974 | Please also see Pedley and Rylance, 1977. |

References

Martinho Simões
Martinho Simões, J.A.,
Private communication (see http://webbook.nist.gov/chemistry/om/). [all data]
Pawlenko, 1969
Pawlenko, S.,
Chem. Ber., 1969, 102, 1937. [all data]
Buchan, Potemski, et al., 1991
Buchan, Nicholas I.; Potemski, Robert M.; Kuech, Thomas F.,
Vapor pressure and vapor composition of diethylgallium chloride and diethylaluminum chloride,
J. Chem. Eng. Data, 1991, 36, 4, 372-374, https://doi.org/10.1021/je00004a008
. [all data]
Fic and Dvorak, 1965
Fic, V.; Dvorak, J.,
Organo-Aluminum Compounds. 1. Vapor Pressure of Triethyl Aluminum and Diethyl Aluminium Chloride,
Chem. Prum., 1965, 15, 732-735. [all data]
Shaulov and Shmyreva, 1968
Shaulov, Yu.Kh.; Shmyreva, G.O.,
Russ. J. Phys. Chem., 1968, 42, 1008. [all data]
Smith, 1974
Smith, M.B.,
J. Organometal. Chem., 1974, 76, 171. [all data]
Pedley and Rylance, 1977
Pedley, J.B.; Rylance, J.,
Computer Analysed Thermochemical Data: Organic and Organometallic Compounds, University of Sussex, Brigton, 1977. [all data]