pentacosanenitrile

Phase change data

Data compiled by: Thermodynamics Research Center, NIST Boulder Laboratories, Chris Muzny director

Quantity Value Units Method Reference Comment
Tfus331.65KN/ALevene and Taylor, 1924Uncertainty assigned by TRC = 2. K
Tfus329.65KN/ALevene and Taylor, 1922Uncertainty assigned by TRC = 2. K
Tfus331.15KN/AMarie, 1896Uncertainty assigned by TRC = 3. K

In addition to the Thermodynamics Research Center (TRC) data available from this site, much more physical and chemical property data is available from the following TRC products:

References

Levene and Taylor, 1924
Levene, P.A.; Taylor, F.A., J. Biol. Chem., 1924, 59, 905. [all data]

Levene and Taylor, 1922
Levene, P.A.; Taylor, J. Biol. Chem., 1922, 52, 227. [all data]

Marie, 1896
Marie, T., Acid Chlorides, Amides, Nitriles I. Cerotic Acid, Ann. Chim. Phys., 1896, 206, 2061. [all data]