2-Propen-1-one, 3-(4-methoxyphenyl)-1-phenyl-
- Formula: C16H14O2
- Molecular weight: 238.2812
- IUPAC Standard InChIKey: XUFXKBJMCRJATM-FMIVXFBMSA-N
- CAS Registry Number: 959-33-1
- Chemical structure:
View 3d structure (requires JavaScript / HTML 5) - Other names: Chalcone, 4-methoxy-; Phenyl p-methoxystyryl ketone; 3-(4-Methoxyphenyl)-1-phenyl-2-propen-1-one; 4-Methoxychalcone; 4'-Methoxybenzylideneacetophenone; (4-Methoxybenzylidene)acetophenone; p-Methoxystyryl phenyl ketone; 4-Methoxystyryl phenyl ketone; (p-Methoxybenzylidene)acetophenone; 1-Phenyl-3-(4-methoxyphenyl)-2-propen-1-one; NSC 11866

Condensed phase thermochemistry data

Data compiled by: Hussein Y. Afeefy, Joel F. Liebman, and Stephen E. Stein
Quantity | Value | Units | Method | Reference | Comment |
---|---|---|---|---|---|
ΔfH°solid | -195. | kJ/mol | Ccb | Moureu, 1930 | |
Quantity | Value | Units | Method | Reference | Comment |
ΔcH°solid | -8138.7 | kJ/mol | Ccb | Moureu, 1930 | Corresponding ΔfHºsolid = -158. kJ/mol (simple calculation by NIST; no Washburn corrections) |

References

Moureu, 1930
Moureu, M.H.,
Des sur la tautomerie des dicetones α,
Ann. Chem., 1930, 14, 283-405. [all data]