tert-butyl(dimethyl)silyl 2-([tert-butyl(dimethyl)silyl]oxy)-3-methylbut-2-enoate
- Formula: C17H36O3Si2
- Molecular weight: 344.6369
- IUPAC Standard InChIKey: VQWZZROTBMSRRS-UHFFFAOYSA-N
- CAS Registry Number: 959044-48-5
- Chemical structure:
View 3d structure (requires JavaScript / HTML 5) - Other names: 2-Ketoisovaleric acid, diTBDMS

Van Den Dool and Kratz RI, non-polar column, temperature ramp

Column type | Active phase | I | Reference | Comment |
---|---|---|---|---|
Capillary | DB-5 | 1646. | Ohie, Fu, et al., 2000 | 30. m/0.25 mm/0.25 μm, 100. C @ 1. min, 10. K/min, 300. C @ 15. min |

References

Ohie, Fu, et al., 2000
Ohie, T.; Fu, X.; Iga, M.; Kimura, M.; Yamaguchi, S.,
Gas chromatography-mass spectrometry with tert .-butyldimethylsilyl derivatization: use of the simplified sample preparations and the automated data system to screen for organic acidemias,
J. Chromatogr. B, 2000, 746, 1, 63-73, https://doi.org/10.1016/S0378-4347(00)00105-5
. [all data]