Benzenamine, 2,5-dichloro-
- Formula: C6H5Cl2N
- Molecular weight: 162.017
- IUPAC Standard InChIKey: AVYGCQXNNJPXSS-UHFFFAOYSA-N
- CAS Registry Number: 95-82-9
- Chemical structure:
View 3d structure (requires JavaScript / HTML 5) - Other names: Aniline, 2,5-dichloro-; Amarthol Fast Scarlet GG Base; Amarthol Fast Scarlet GGS Base; Azobase DCA; Azoene Fast Scarlet 2G Base; Azogene Fast Scarlet GGC; C.I. Azoic Diazo Component 3; C.I. 37010; Daito Scarlet Base GG; Devol Scarlet 2GS Base; Diazo Fast Scarlet GG; Diazol Scarlet 2Zh; Fast Red SGG Base; Fast Scarlet Base GGT; Fast Scarlet Base 2J; Fast Scarlet Base 2JS; Fast Scarlet DS Base; Fast Scarlet GG Base; Fast Scarlet GGS Base; Fast Scarlet MDC Base; Fast Scarlet 2G; Hiltonil Fast Scarlet 2G Base; Hiltonil Fast Scarlet 2GS Base; Hindamine Scarlet GG; Kambamine Scarlet GG Base; Kayaku Scarlet GG Base; Lake Scarlet GG Base; Mitsui Scarlet GG Base; Naphthanil Scarlet 2G Base; Naphtoelan Fast Scarlet GG Base; Natasol Scarlet GG Salt; Sanyo Fast Scarlet GG Base; Scarlet Base Ciba I; Scarlet Base GG; Scarlet Base NGG; Scarlet Salt Ciba I; Spectrolene Scarlet 2G; Stabamine Scarlet GG; Symulon Scarlet 2G Base; 1-Amino-2,5-dichlorobenzene; 2,5-Dichloro-1-aminobenzene; 2,5-Dichloroaniline; p-Dichloroaniline; Amarthol fast scarlet GG salt; Azoene fast scarlet 2g salt; Azofix scarlet GG salt; Azogene fast scarlet GG (free base); Azoic diazo component 3; Daito scarlet salt GG; Devol scarlet salt A; Devol scarlet 2GS salt; Durgasol scarlet GG salt; Fast scarlet ds salt; Fast scarlet ggs salt; Fast scarlet salt ggn; Fast scarlet salt GG; Fast scarlet GG salt; Fast scarlet 2g base; Fast scarlet 2g salt; Fast scarlet 2j salt; Hiltosal fast scarlet 2g salt; Hindasol fast scarlet GG salt; Kako scarlet GG salt; Meisei scarlet GG salt; Mitsui scarlet GG salt; Naphtoelan fast scarlet GG salt; Sanyo fast scarlet salt GG; Scarlet base irga I (free base); Scarlet salt irga I; Scarlet salt ngg; Scarlet 2g base; Scarlet 2g salt; Symulon scarlet 2g salt; 2,5-Dichloranilin; Azogene fast scarlet gg; Devol scarlet A (Free base); 2,5-Dichlorobenzenamine; 2-Amino-1,4-dichlorobenzene; Benzene, 1-amino-2,5-dichloro; 2,5-Dichlorophenylamine

Phase change data

Data compiled as indicated in comments:
BS - Robert L. Brown and Stephen E. Stein
TRC - Thermodynamics Research Center, NIST Boulder Laboratories, Chris Muzny director
AC - William E. Acree, Jr., James S. Chickos
Quantity | Value | Units | Method | Reference | Comment |
---|---|---|---|---|---|
Tboil | 524.2 | K | N/A | Weast and Grasselli, 1989 | BS |
Quantity | Value | Units | Method | Reference | Comment |
Tfus | 318.03 | K | N/A | Witschonke, 1954 | Uncertainty assigned by TRC = 0.2 K; TRC |
Tfus | 318.05 | K | N/A | Witschonke, 1954 | Uncertainty assigned by TRC = 0.1 K; TRC |
Quantity | Value | Units | Method | Reference | Comment |
ΔsubH° | 83.4 ± 1.3 | kJ/mol | C | Ribeiro da Silva, Amaral, et al., 2006 | AC |

Normal alkane RI, non-polar column, temperature ramp

Column type | Active phase | I | Reference | Comment |
---|---|---|---|---|
Capillary | TR-1 | 1284. | Gruzdev, Filippova, et al., 2011 | 30. m/0.32 mm/0.25 μm, Helium, 5. K/min; Tstart: 50. C; Tend: 300. C |
Capillary | Ultra-1 | 1284. | Okumura, 1991 | 25. m/0.32 mm/0.25 μm, He, 3. K/min; Tstart: 80. C; Tend: 260. C |

Normal alkane RI, non-polar column, custom temperature program

Column type | Active phase | I | Reference | Comment |
---|---|---|---|---|
Capillary | OV-1, SE-30, Methyl silicone, SP-2100, OV-101, DB-1, etc. | 1288. | Waggott and Davies, 1984 | Hydrogen; Column length: 50. m; Column diameter: 0.32 mm; Program: not specified |
Capillary | OV-1 | 1288. | Waggott and Davies, 1984 | Hydrogen; Column length: 50. m; Column diameter: 0.32 mm; Program: not specified |

Normal alkane RI, polar column, custom temperature program

Column type | Active phase | I | Reference | Comment |
---|---|---|---|---|
Capillary | Superox 0.6; Carbowax 20M | 2226. | Waggott and Davies, 1984 | Hydrogen; Column length: 50. m; Column diameter: 0.32 mm; Program: not specified |
Capillary | Carbowax 400, Carbowax 20M, Carbowax 1540, Carbowax 4000, Superox 06, PEG 20M, etc. | 2226. | Waggott and Davies, 1984 | Hydrogen; Column length: 50. m; Column diameter: 0.32 mm; Program: not specified |

Lee's RI, non-polar column, temperature ramp

Column type | Active phase | I | Reference | Comment |
---|---|---|---|---|
Capillary | HP5-MS | 229. | Vrana, Paschke, et al., 2005 | 30. m/0.25 mm/0.25 μm, Helium, 50. C @ 5. min, 5. K/min, 280. C @ 10. min |

References

Weast and Grasselli, 1989
CRC Handbook of Data on Organic Compounds, 2nd Editon, Weast,R.C and Grasselli, J.G., ed(s)., CRC Press, Inc., Boca Raton, FL, 1989, 1. [all data]
Witschonke, 1954
Witschonke, C.R.,
Freezing point and purity data for some organic compounds,
Anal. Chem., 1954, 26, 562-4. [all data]
Ribeiro da Silva, Amaral, et al., 2006
Ribeiro da Silva, Manuel A.V.; Amaral, Luísa M.P.F.; Gomes, José R.B.,
Experimental and Computational Investigation of the Thermochemistry of the Six Isomers of Dichloroaniline,
J. Phys. Chem. A, 2006, 110, 29, 9301-9306, https://doi.org/10.1021/jp062438c
. [all data]
Gruzdev, Filippova, et al., 2011
Gruzdev, I.V.; Filippova, M.V.; Zenkevich, I.G.; Kondratenok, B.M.,
Identification of bromination products of chlorosubstituted anilines in aqueous media by using gas chromatography,
Rus. J. Applied Chem., 2011, 84, 10, 1656-1667, https://doi.org/10.1134/S1070427211100132
. [all data]
Okumura, 1991
Okumura, T.,
retention indices of environmental chemicals on methyl silicone capillary column,
Journal of Environmental Chemistry (Japan), 1991, 1, 2, 333-358, https://doi.org/10.5985/jec.1.333
. [all data]
Waggott and Davies, 1984
Waggott, A.; Davies, I.W.,
Identification of organic pollutants using linear temperature programmed retention indices (LTPRIs) - Part II, 1984, retrieved from http://dwi.defra.gov.uk/research/completed-research/reports/dwi0383.pdf. [all data]
Vrana, Paschke, et al., 2005
Vrana, B.; Paschke, H.; Paschke, A.; Popp, P.; Schuurmann, G.,
Performance of semipermeable membrane devices for sampling of organic contaminants in groun water,
J. Envirom. Monit., 2005, 7, 5, 500-508, https://doi.org/10.1039/b411645c
. [all data]