Benzenamine, 3,4-dichloro-
- Formula: C6H5Cl2N
- Molecular weight: 162.017
- IUPAC Standard InChIKey: SDYWXFYBZPNOFX-UHFFFAOYSA-N
- CAS Registry Number: 95-76-1
- Chemical structure:
View 3d structure (requires JavaScript / HTML 5) - Other names: Aniline, 3,4-dichloro-; DCA; 3,4-Dichloroaniline; 3,4-Dichlorobenzenamine; 3,4-DCA; 4,5-Dichloroaniline; 1-Amino-3,4-dichlorobenzene; 3,4-Dichloranilin; 3,4-Dichloraniline; 3,4-Dichlorophenylamine; 4-Amino-1,2-dichlorobenzene; LY 004892; NSC 247

Condensed phase thermochemistry data

Data compiled by: Hussein Y. Afeefy, Joel F. Liebman, and Stephen E. Stein
Quantity | Value | Units | Method | Reference | Comment |
---|---|---|---|---|---|
ΔfH°solid | -89.12 | kJ/mol | Ccb | Masalitinova, Oleinikova, et al., 1981 | |
Quantity | Value | Units | Method | Reference | Comment |
ΔcH°solid | -3033.8 ± 2.2 | kJ/mol | Ccb | Masalitinova, Oleinikova, et al., 1981 |

Phase change data

Data compiled as indicated in comments:
BS - Robert L. Brown and Stephen E. Stein
TRC - Thermodynamics Research Center, NIST Boulder Laboratories, Chris Muzny director
AC - William E. Acree, Jr., James S. Chickos
Quantity | Value | Units | Method | Reference | Comment |
---|---|---|---|---|---|
Tboil | 545.2 | K | N/A | Weast and Grasselli, 1989 | BS |
Quantity | Value | Units | Method | Reference | Comment |
Tfus | 618.1 | K | N/A | Zhuravlev, Sivkova, et al., 1988 | Crystal phase 1 phase; Uncertainty assigned by TRC = 0.2 K; TRC |
Tfus | 345.14 | K | N/A | Witschonke, 1954 | Uncertainty assigned by TRC = 0.2 K; TRC |
Tfus | 345.3 | K | N/A | Witschonke, 1954 | Uncertainty assigned by TRC = 0.1 K; TRC |
Reduced pressure boiling point
Tboil (K) | Pressure (bar) | Reference | Comment |
---|---|---|---|
418.2 | 0.020 | Weast and Grasselli, 1989 | BS |
Enthalpy of vaporization
ΔvapH (kJ/mol) | Temperature (K) | Method | Reference | Comment |
---|---|---|---|---|
58.6 | 435. | A | Stephenson and Malanowski, 1987 | Based on data from 420. to 545. K.; AC |
Enthalpy of fusion
ΔfusH (kJ/mol) | Temperature (K) | Reference | Comment |
---|---|---|---|
21.69 | 344.5 | Verevkin and Schick, 2003 | AC |

Reaction thermochemistry data

Data compiled by: Hussein Y. Afeefy, Joel F. Liebman, and Stephen E. Stein
Individual Reactions
By formula: C13H8Cl4N2O = C7H3Cl2NO + C6H5Cl2N
Quantity | Value | Units | Method | Reference | Comment |
---|---|---|---|---|---|
ΔrH° | 102.1 ± 5.6 | kJ/mol | Eqk | Chimishkyan, Svetlova, et al., 1984 | solid phase; Dissociation |

Kovats' RI, non-polar column, temperature ramp

Column type | Active phase | I | Reference | Comment |
---|---|---|---|---|
Capillary | DB-1 | 1387. | Hall, Whitehead, et al., 1986 | He, 6. K/min; Column length: 15. m; Column diameter: 0.25 mm; Tstart: 100. C; Tend: 270. C |

Normal alkane RI, non-polar column, temperature ramp

Column type | Active phase | I | Reference | Comment |
---|---|---|---|---|
Capillary | TR-1 | 1373. | Gruzdev, Filippova, et al., 2011 | 30. m/0.32 mm/0.25 μm, Helium, 5. K/min; Tstart: 50. C; Tend: 300. C |
Capillary | Ultra-1 | 1372. | Okumura, 1991 | 25. m/0.32 mm/0.25 μm, He, 3. K/min; Tstart: 80. C; Tend: 260. C |

Normal alkane RI, non-polar column, custom temperature program

Column type | Active phase | I | Reference | Comment |
---|---|---|---|---|
Capillary | OV-1, SE-30, Methyl silicone, SP-2100, OV-101, DB-1, etc. | 1377. | Waggott and Davies, 1984 | Hydrogen; Column length: 50. m; Column diameter: 0.32 mm; Program: not specified |
Capillary | OV-1 | 1377. | Waggott and Davies, 1984 | Hydrogen; Column length: 50. m; Column diameter: 0.32 mm; Program: not specified |

Normal alkane RI, polar column, custom temperature program

Column type | Active phase | I | Reference | Comment |
---|---|---|---|---|
Capillary | Superox 0.6; Carbowax 20M | 2519. | Waggott and Davies, 1984 | Hydrogen; Column length: 50. m; Column diameter: 0.32 mm; Program: not specified |
Capillary | Carbowax 400, Carbowax 20M, Carbowax 1540, Carbowax 4000, Superox 06, PEG 20M, etc. | 2519. | Waggott and Davies, 1984 | Hydrogen; Column length: 50. m; Column diameter: 0.32 mm; Program: not specified |

References

Masalitinova, Oleinikova, et al., 1981
Masalitinova, T.N.; Oleinikova, T.P.; Ryadnenko, V.L.; Kiseleva, N.N.; Lebedeva, N.D.,
Thermal effects of the hydrogenation of chloronitrobenzenes,
J. Appl. Chem. USSR, 1981, 54, 1551-1554, In original 1799. [all data]
Weast and Grasselli, 1989
CRC Handbook of Data on Organic Compounds, 2nd Editon, Weast,R.C and Grasselli, J.G., ed(s)., CRC Press, Inc., Boca Raton, FL, 1989, 1. [all data]
Zhuravlev, Sivkova, et al., 1988
Zhuravlev, E.Z.; Sivkova, V.N.; Mulyanov, P.V.; Bogdanova, T.M.,
Density, viscosity, dielectric constant and vapor pressure of 3,4- dichloroaniline,
Deposited Doc. ONIITEkhim Cherkassy, 1988, Doc. No. 592 khp - 88, 1988. [all data]
Witschonke, 1954
Witschonke, C.R.,
Freezing point and purity data for some organic compounds,
Anal. Chem., 1954, 26, 562-4. [all data]
Stephenson and Malanowski, 1987
Stephenson, Richard M.; Malanowski, Stanislaw,
Handbook of the Thermodynamics of Organic Compounds, 1987, https://doi.org/10.1007/978-94-009-3173-2
. [all data]
Verevkin and Schick, 2003
Verevkin, Sergey P.; Schick, Christoph,
Determination of vapor pressures, enthalpies of sublimation, enthalpies of vaporization, and enthalpies of fusion of a series of chloro-aminobenzenes and chloro-nitrobenzenes,
Fluid Phase Equilibria, 2003, 211, 2, 161-177, https://doi.org/10.1016/S0378-3812(03)00181-X
. [all data]
Chimishkyan, Svetlova, et al., 1984
Chimishkyan, A.L.; Svetlova, L.P.; Leonova, T.V.; Gluyaev, N.D.,
Thermal decomposition of substituted ureas,
J. Gen. Chem. USSR, 1984, 54, 1317-1320. [all data]
Hall, Whitehead, et al., 1986
Hall, G.L.; Whitehead, W.E.; Mourer, C.R.; Shibamoto, T.,
A new gas chromatographic retention index for pesticides and related compounds,
J. Hi. Res. Chromatogr. Chromatogr. Comm., 1986, 9, 5, 266-271, https://doi.org/10.1002/jhrc.1240090503
. [all data]
Gruzdev, Filippova, et al., 2011
Gruzdev, I.V.; Filippova, M.V.; Zenkevich, I.G.; Kondratenok, B.M.,
Identification of bromination products of chlorosubstituted anilines in aqueous media by using gas chromatography,
Rus. J. Applied Chem., 2011, 84, 10, 1656-1667, https://doi.org/10.1134/S1070427211100132
. [all data]
Okumura, 1991
Okumura, T.,
retention indices of environmental chemicals on methyl silicone capillary column,
Journal of Environmental Chemistry (Japan), 1991, 1, 2, 333-358, https://doi.org/10.5985/jec.1.333
. [all data]
Waggott and Davies, 1984
Waggott, A.; Davies, I.W.,
Identification of organic pollutants using linear temperature programmed retention indices (LTPRIs) - Part II, 1984, retrieved from http://dwi.defra.gov.uk/research/completed-research/reports/dwi0383.pdf. [all data]