Benzenamine, 3-chloro-4-methyl-
- Formula: C7H8ClN
- Molecular weight: 141.598
- IUPAC Standard InChIKey: RQKFYFNZSHWXAW-UHFFFAOYSA-N
- CAS Registry Number: 95-74-9
- Chemical structure:
View 3d structure (requires JavaScript / HTML 5) - Other names: p-Toluidine, 3-chloro-; DRC 1347; 1-Amino-3-Chloro-4-methylbenzene; 2-Chloro-4-aminotoluene; 3-Chloro-p-toluidine; 3-Chloro-4-methylaniline; 3-Chloro-4-methylbenzenamine; 4-Methyl-3-chloroaniline; 3-Chloro-4-toluidine; 4-Amino-2-chlorotoluene; DRC 1339; NCI-C02040; 3-Chloro-4-methylphenylamine; NSC 96620; 2-chloro-4-toluidine

Condensed phase thermochemistry data

Data compiled by: Hussein Y. Afeefy, Joel F. Liebman, and Stephen E. Stein
Quantity | Value | Units | Method | Reference | Comment |
---|---|---|---|---|---|
ΔfH°liquid | 23. ± 6.7 | kJ/mol | Ccb | Zhuravlev, Melent'eva, et al., 1980 | |
Quantity | Value | Units | Method | Reference | Comment |
ΔcH°liquid | -3607. ± 6.7 | kJ/mol | Ccb | Zhuravlev, Melent'eva, et al., 1980 |

Phase change data

Data compiled by: Robert L. Brown and Stephen E. Stein
Quantity | Value | Units | Method | Reference | Comment |
---|---|---|---|---|---|
Tboil | 510.7 | K | N/A | Aldrich Chemical Company Inc., 1990 |

Normal alkane RI, polar column, custom temperature program

Data compiled by: NIST Mass Spectrometry Data Center, William E. Wallace, director

Column type CapillaryCapillary
Active phase Superox 0.6; Carbowax 20MCarbowax 400, Carbowax 20M, Carbowax 1540, Carbowax 4000, Superox 06, PEG 20M, etc.
Column length (m) 50.50.
Carrier gas HydrogenHydrogen
Substrate
Column diameter (mm) 0.320.32
Phase thickness (μm)
Program not specifiednot specified
I 1957.1957.
ReferenceWaggott and Davies, 1984Waggott and Davies, 1984
Comment MSDC-RI MSDC-RI

Gas phase thermochemistry data

Data compiled as indicated in comments:
ALS - Hussein Y. Afeefy, Joel F. Liebman, and Stephen E. Stein

Quantity Value Units Method Reference Comment
Δfgas4.0kcal/molSemiStewart, 2004
Δfgas18.0 ± 1.7kcal/molCcbZhuravlev, Melent'eva, et al., 1980ALS

Van Den Dool and Kratz RI, non-polar column, temperature ramp

View large format table.

Column type Active phase I Reference Comment
CapillaryOV-11257.3Gautzsch and Zinn, 19968. K/min; Tstart: 35. C; Tend: 300. C

References

Zhuravlev, Melent'eva, et al., 1980
Zhuravlev, E.Z.; Melent'eva, T.I.; Mulyanov, N.B.; Kormushehkina, A.I.; Konstantinov, I.I.,
Physicochemical properties of 3-chloro-4-methylphenyl isocyanate, Deposited Document, SPSTL 651 Khp-D80. Chem. Abst. 97-12145s, 1980, 1-15. [all data]
Aldrich Chemical Company Inc., 1990
Aldrich Chemical Company Inc.,
Catalog Handbook of Fine Chemicals, Aldrich Chemical Company, Inc., Milwaukee WI, 1990, 1. [all data]