1,4-Benzenediol, 2-methyl-
- Formula: C7H8O2
- Molecular weight: 124.1372
- IUPAC Standard InChIKey: CNHDIAIOKMXOLK-UHFFFAOYSA-N
- CAS Registry Number: 95-71-6
- Chemical structure:
View 3d structure (requires JavaScript / HTML 5) - Species with the same structure:
- Other names: Hydroquinone, methyl-; p-Toluhydroquinol; p-Toluhydroquinone; p-Toluquinol; Methyl-p-hydroquinone; Methylhydroquinone; Toluhydroquinone; Toluquinol; Tolylhydroquinone; THQ; 2-Methyl-1,4-Benzenediol; 2-Methylhydroquinone; 2,5-Dihydroxytoluene; 1,4-Dihydroxy-2-methylbenzene; 2,5-Toluenediol; 2-Methyl-p-hydroquinone; 2-Methyl-1,4-hydroquinone; NSC 4962; 2-Methyl-1,4-benzenediol (2-methylhydroquinone)

Condensed phase thermochemistry data

Data compiled as indicated in comments:
ALS - Hussein Y. Afeefy, Joel F. Liebman, and Stephen E. Stein
DH - Eugene S. Domalski and Elizabeth D. Hearing
Quantity | Value | Units | Method | Reference | Comment |
---|---|---|---|---|---|
ΔcH°solid | -3492. | kJ/mol | Ccb | Swietoslawski and Starczedska, 1925 | Corresponding ΔfHºsolid = -405. kJ/mol (simple calculation by NIST; no Washburn corrections); ALS |
Constant pressure heat capacity of solid
Cp,solid (J/mol*K) | Temperature (K) | Reference | Comment |
---|---|---|---|
174.9 | 323. | Satoh and Sogabe, 1941 | T = 0 to 100 C. Mean value.; DH |

Phase change data

Data compiled by: William E. Acree, Jr., James S. Chickos
Quantity | Value | Units | Method | Reference | Comment |
---|---|---|---|---|---|
ΔsubH° | 108.4 ± 3.9 | kJ/mol | ME | Ribeiro da Silva and Lobo Ferreira, 2009 | Based on data from 325. to 341. K. |
ΔsubH° | 100.4 ± 1.4 | kJ/mol | GS | Verevkin, 1999 | Based on data from 333. to 368. K. |
Enthalpy of sublimation
ΔsubH (kJ/mol) | Temperature (K) | Method | Reference | Comment |
---|---|---|---|---|
107.8 ± 1.1 | 333. | ME | Ribeiro da Silva and Lobo Ferreira, 2009 | Based on data from 325. to 341. K. |
97.2 ± 1.4 | 351. | GS | Verevkin, 1999 | Based on data from 333. to 368. K. |
Enthalpy of fusion
ΔfusH (kJ/mol) | Temperature (K) | Method | Reference |
---|---|---|---|
27.6 | 404.2 | DSC | Verevkin, 1999 |

Normal alkane RI, non-polar column, custom temperature program

Column type | Active phase | I | Reference | Comment |
---|---|---|---|---|
Capillary | HP-5 | 1223. | Zhao, Li, et al., 2008 | 30. m/0.25 mm/0.25 μm; Program: 40 0C (2 min) 5 0C/min -> 80 0C 7 oC/min -> 160 0C 9 0C/min -> 200 0C 20 0C/min -> 280 0C (10 min) |
Capillary | HP-5 | 1226. | Zhao, Li, et al., 2008 | 30. m/0.25 mm/0.25 μm; Program: not specified |

References

Swietoslawski and Starczedska, 1925
Swietoslawski, W.; Starczedska, H.,
Correction des donnees thermochimiques de M.A. Valeur,
J. Chem. Phys., 1925, 22, 399-401. [all data]
Satoh and Sogabe, 1941
Satoh, S.; Sogabe, T.,
The heat capacities of some organic compounds containing nitrogen and the atomic heat of nitrogen. (3), Sci.,
Pap. Inst. Phys. Chem. Res. (Tokyo), 1941, 38, 238-245. [all data]
Ribeiro da Silva and Lobo Ferreira, 2009
Ribeiro da Silva, Manuel A.V.; Lobo Ferreira, Ana I.M.C.,
Experimental standard molar enthalpies of formation of some methylbenzenediol isomers,
The Journal of Chemical Thermodynamics, 2009, 41, 10, 1096-1103, https://doi.org/10.1016/j.jct.2009.04.015
. [all data]
Verevkin, 1999
Verevkin, Sergey P.,
Substituent effects on the benzene ring. Prediction of the thermochemical properties of alkyl substituted hydroquinones,
Phys. Chem. Chem. Phys., 1999, 1, 1, 127-131, https://doi.org/10.1039/a806706f
. [all data]
Zhao, Li, et al., 2008
Zhao, Y.; Li, J.; Xu, Y.; Duan, H.; Fan, W.; Zhao, G.,
EXtraction, preparation and identification of volatile compounds in Changyu XO brandy,
Chinese J. Chromatogr., 2008, 26, 2, 212-222, https://doi.org/10.1016/S1872-2059(08)60014-0
. [all data]