3-Ethylidene-1,4-pentadiene
- Formula: C7H10
- Molecular weight: 94.1543
- IUPAC Standard InChIKey: RUKCSZJSODAPHD-UHFFFAOYSA-N
- CAS Registry Number: 95540-87-7
- Chemical structure:
View 3d structure (requires JavaScript / HTML 5) - Permanent link for this species. Use this link for bookmarking this species for future reference.

Gas phase thermochemistry data

Data compiled by: Hussein Y. Afeefy, Joel F. Liebman, and Stephen E. Stein
Quantity | Value | Units | Method | Reference | Comment |
---|---|---|---|---|---|
ΔfH°gas | 159. | kJ/mol | Chyd | Roth, Adamczak, et al., 1991 |

Reaction thermochemistry data

Data compiled by: Hussein Y. Afeefy, Joel F. Liebman, and Stephen E. Stein
Individual Reactions
By formula: 3H2 + C7H10 = C7H16
Quantity | Value | Units | Method | Reference | Comment |
---|---|---|---|---|---|
ΔrH° | -349. ± 0.4 | kJ/mol | Chyd | Roth, Adamczak, et al., 1991 | liquid phase |

References

Roth, Adamczak, et al., 1991
Roth, W.R.; Adamczak, O.; Breuckmann, R.; Lennartz, H.-W.; Boese, R.,
Die Berechnung von Resonanzenergien; das MM2ERW-Kraftfeld,
Chem. Ber., 1991, 124, 2499-2521. [all data]