2,3-Butanedione, dioxime
- Formula: C4H8N2O2
- Molecular weight: 116.1185
- IUPAC Standard InChIKey: JGUQDUKBUKFFRO-UHFFFAOYSA-N
- CAS Registry Number: 95-45-4
- Chemical structure:

Condensed phase thermochemistry data

Data compiled by: Hussein Y. Afeefy, Joel F. Liebman, and Stephen E. Stein
Quantity | Value | Units | Method | Reference | Comment |
---|---|---|---|---|---|
ΔcH°solid | -2555.6 | kJ/mol | Ccb | Wood and Jones, 1963 | |
ΔcH°solid | -2543. | kJ/mol | Ccb | Milone and Venturello, 1936 | At 292 K,Atti Accad. Sci. Torino. Fis, Mat. Nat. 1936,71,395 |

Phase change data

Data compiled by: William E. Acree, Jr., James S. Chickos
Enthalpy of sublimation
ΔsubH (kJ/mol) | Temperature (K) | Method | Reference | Comment |
---|---|---|---|---|
96.8 | 341.5 | A | Stephenson and Malanowski, 1987 | Based on data from 331. to 352. K. |

References

Wood and Jones, 1963
Wood, J.L.; Jones, M.M.,
Heats of formation and coordinate bond energies of some nickel(II) chelates,
J. Phys. Chem., 1963, 67, 1049-1051. [all data]
Milone and Venturello, 1936
Milone, M.; Venturello, G.,
Ricerche sulle diossime - CXVII,
Gazz. Chim. Ital., 1936, 66, 808-812. [all data]
Stephenson and Malanowski, 1987
Stephenson, Richard M.; Malanowski, Stanislaw,
Handbook of the Thermodynamics of Organic Compounds, 1987, https://doi.org/10.1007/978-94-009-3173-2
. [all data]