Benzene, 1-nitro-4-(phenylthio)-
- Formula: C12H9NO2S
- Molecular weight: 231.270
- IUPAC Standard InChIKey: RJCBYBQJVXVVKB-UHFFFAOYSA-N
- CAS Registry Number: 952-97-6
- Chemical structure:
View 3d structure (requires JavaScript / HTML 5) - Other names: Sulfide, p-nitrophenyl phenyl; p-Nitrodiphenyl sulfide; p-Nitrophenyl phenyl sulfide; Phenyl p-nitrophenylsulfide; 4-Nitrodiphenyl sulfide; 4-Nitrophenyl phenyl sulfide; 4-(Phenylthio)nitrobenzene; 1-Nitro-4-(phenylsulfanyl)benzene; 1-Nitro-4-(phenylthio)benzene; NSC 87341; 4-nitrophenyl phenyl sulphide

Phase change data

Data compiled by: Robert L. Brown and Stephen E. Stein
Reduced pressure boiling point
Tboil (K) | Pressure (atm) | Reference |
---|---|---|
561.4 | 0.132 | Weast and Grasselli, 1989 |

References

Weast and Grasselli, 1989
CRC Handbook of Data on Organic Compounds, 2nd Editon, Weast,R.C and Grasselli, J.G., ed(s)., CRC Press, Inc., Boca Raton, FL, 1989, 1. [all data]