2,4,6,2',4',6'-Hexamethyl bicyclohexyl

Condensed phase thermochemistry data

Data compiled by: Hussein Y. Afeefy, Joel F. Liebman, and Stephen E. Stein

Quantity Value Units Method Reference Comment
Δcliquid-11389.9kJ/molCcbSmith and Easley, 1963Heat of combustion was corrected for net Hc; Corresponding Δfliquid = -552.46 kJ/mol (simple calculation by NIST; no Washburn corrections)

References

Smith and Easley, 1963
Smith, J.O.; Easley, K.W., Ortho-substituted bicyclohexyl hydrocarbons as high energy fuels, Patent No. 3,113,425 to Monsanto Research Corp., Everett, MA, USA 12/10/63, 1963, 1. [all data]