CAS Reg. No. 952499-85-3
- CAS Registry Number: 952499-85-3

Reaction thermochemistry data

Data compiled by: John E. Bartmess
Individual Reactions
(CAS Reg. No. 952499-85-3 • 4294967295) + = CAS Reg. No. 952499-85-3
By formula: (CAS Reg. No. 952499-85-3 • 4294967295H) + H = CAS Reg. No. 952499-85-3
Quantity | Value | Units | Method | Reference | Comment |
---|---|---|---|---|---|
ΔrH° | 187. ± 18. | kJ/mol | N/A | Calvi, Andrews, et al., 2007 | gas phase |

References

Calvi, Andrews, et al., 2007
Calvi, R.M.D.; Andrews, D.H.; Lineberger, W.C.,
Negative ion photoelectron spectroscopy of copper hydrides,
Chem. Phys. Lett., 2007, 442, 1-3, 12-16, https://doi.org/10.1016/j.cplett.2007.05.060
. [all data]