trans-2-heptyl-6-butyldecalin

Phase change data

Data compiled by: William E. Acree, Jr., James S. Chickos

Enthalpy of fusion

ΔfusH (kJ/mol) Temperature (K) Reference
31.8295.3Varech, Brienne, et al., 1985

References

Varech, Brienne, et al., 1985
Varech, D.; Brienne, M.J.; Jacques, J., Synthese commode d'hydrocarbures nematiques, Tetrahedron Letters, 1985, 26, 1, 61-64, https://doi.org/10.1016/S0040-4039(00)98466-1 . [all data]