Bicyclo[2.2.1]hept-5-ene-2-carbonitrile
- Formula: C8H9N
- Molecular weight: 119.1638
- IUPAC Standard InChIKey: BMAXQTDMWYDIJX-UHFFFAOYSA-N
- CAS Registry Number: 95-11-4
- Chemical structure:
View 3d structure (requires JavaScript / HTML 5) - Stereoisomers:
- Other names: 5-Norbornene-2-carbonitrile; 5-Cyanobicyclo[2.2.1]hept-2-ene

Phase change data

Data compiled by: Robert L. Brown and Stephen E. Stein
Reduced pressure boiling point
Tboil (K) | Pressure (bar) | Reference |
---|---|---|
357.2 | 0.013 | Weast and Grasselli, 1989 |
363. to 367. | 0.027 | Frinton Laboratories Inc., 1986 |

References

Weast and Grasselli, 1989
CRC Handbook of Data on Organic Compounds, 2nd Editon, Weast,R.C and Grasselli, J.G., ed(s)., CRC Press, Inc., Boca Raton, FL, 1989, 1. [all data]
Frinton Laboratories Inc., 1986
Frinton Laboratories Inc.,
Catalog Number 11, Frinton Laboratories Inc., Vineland, NJ, 1986, 99. [all data]