N-acetylsarcosinamide
- Formula: C5H10N2O2
- Molecular weight: 130.1451
- IUPAC Standard InChIKey: KYKQPVBWGDUGDS-UHFFFAOYSA-N
- CAS Registry Number: 95048-77-4
- Chemical structure:
View 3d structure (requires JavaScript / HTML 5) - Permanent link for this species. Use this link for bookmarking this species for future reference.

Phase change data

Data compiled by: William E. Acree, Jr., James S. Chickos
Enthalpy of fusion
ΔfusH (kJ/mol) | Temperature (K) | Reference |
---|---|---|
27.4 | 412.7 | Puliti, De Sena, et al., 1997 |

References

Puliti, De Sena, et al., 1997
Puliti, R.; De Sena, C.; Giancola, C.,
Crystal structures and melting thermodynamics of N-acetylsarcosinamide and N-acetyl-L-isoleucinamide,
Journal of Thermal Analysis, 1997, 48, 6, 1249-1262, https://doi.org/10.1007/BF01983435
. [all data]