Benzaldehyde, 2,4-dihydroxy-
- Formula: C7H6O3
- Molecular weight: 138.1207
- IUPAC Standard InChIKey: IUNJCFABHJZSKB-UHFFFAOYSA-N
- CAS Registry Number: 95-01-2
- Chemical structure:
View 3d structure (requires JavaScript / HTML 5) - Other names: β-Resorcylaldehyde; β-Resorcaldehyde; β-Resorcinaldehyde; β-Resorcylic aldehyde; Salicylaldehyde, 4-hydroxy-; 2,4-Dihydroxybenzaldehyde; 2,4-Dihydroxybenzenecarbonal; 4-Hydroxysalicylaldehyde; 4-Formylresorcinol; 4-Hydroxysalicyladehyde; NSC 8690

Phase change data

Data compiled by: Robert L. Brown and Stephen E. Stein
Reduced pressure boiling point
Tboil (K) | Pressure (bar) | Reference |
---|---|---|
497.2 | 0.029 | Weast and Grasselli, 1989 |

Normal alkane RI, non-polar column, custom temperature program

Column type | Active phase | I | Reference | Comment |
---|---|---|---|---|
Capillary | ZB-5 | 1450. | de Simon, Estruelas, et al., 2009 | 30. m/0.25 mm/0.25 μm, Helium; Program: 45 0C 3 0C/min -> 230 0C (10 min) 10 0C/min -> 270 0C (21 min) |

Normal alkane RI, polar column, custom temperature program

Column type | Active phase | I | Reference | Comment |
---|---|---|---|---|
Capillary | Supelcowax-10 | 3074. | de Simon, Estruelas, et al., 2009 | 30. m/0.25 mm/0.25 μm, Helium; Program: 45 0C 3 0C/min -> 230 0C (10 min) 10 0C/min -> 270 0C (21 min) |

References

Weast and Grasselli, 1989
CRC Handbook of Data on Organic Compounds, 2nd Editon, Weast,R.C and Grasselli, J.G., ed(s)., CRC Press, Inc., Boca Raton, FL, 1989, 1. [all data]