1,3-Hexanediol, 2-ethyl-
- Formula: C8H18O2
- Molecular weight: 146.2273
- IUPAC Standard InChIKey: RWLALWYNXFYRGW-UHFFFAOYSA-N
- CAS Registry Number: 94-96-2
- Chemical structure:
View 3d structure (requires JavaScript / HTML 5) - Other names: Carbide 6-12; Ethohexadiol; Octylene glycol; Repellent 612; Rutgers 612; 2-Ethyl-1,3-hexandiol; 2-Ethyl-1,3-hexanediol; 2-Ethyl-1,3-hexylene glycol; 6-12; 6-12-Insect repellent; 2-Ethylhexane-1,3-diol; Compound 6-12, insect repellent; Ethyl hexanediol; Ethyl hexylene glycol; ENT 375; 2-Ethyl-3-propyl-1,3-propanediol; 2-Ethylhexanediol-1,3; 3-Hydroxymethyl-n-heptan-4-ol; 2-Ethylhexanediol; EH diol; EHD; Ethyl-1,3-hexane diol-2; NSC 3881; Diol-Kyowa 8

Phase change data

Data compiled as indicated in comments:
BS - Robert L. Brown and Stephen E. Stein
TRC - Thermodynamics Research Center, NIST Boulder Laboratories, Chris Muzny director
AC - William E. Acree, Jr., James S. Chickos
Quantity | Value | Units | Method | Reference | Comment |
---|---|---|---|---|---|
Tboil | 517.2 | K | N/A | Weast and Grasselli, 1989 | BS |
Tboil | 516.25 | K | N/A | Mellan, 1962 | Uncertainty assigned by TRC = 1. K; TRC |
Quantity | Value | Units | Method | Reference | Comment |
ΔvapH° | 79.5 | kJ/mol | N/A | Blaine and Levy, 1974 | Based on data from 331. to 413. K. See also Verevkin, 2007.; AC |

Henry's Law data

Data compiled by: Rolf Sander
Henry's Law constant (water solution)
kH(T) = k°H exp(d(ln(kH))/d(1/T) ((1/T) - 1/(298.15 K)))
k°H = Henry's law constant for solubility in water at 298.15 K (mol/(kg*bar))
d(ln(kH))/d(1/T) = Temperature dependence constant (K)
k°H (mol/(kg*bar)) | d(ln(kH))/d(1/T) (K) | Method | Reference | Comment |
---|---|---|---|---|
2.0×10+6 | E | N/A | Value obtained by missing citation using the group contribution method. |

Normal alkane RI, polar column, custom temperature program

Column type | Active phase | I | Reference | Comment |
---|---|---|---|---|
Capillary | DB-Wax | 2667. | Welke, Manfroi, et al., 2012 | 30. m/0.25 mm/0.25 μm, Helium; Program: not specified |

References

Weast and Grasselli, 1989
CRC Handbook of Data on Organic Compounds, 2nd Editon, Weast,R.C and Grasselli, J.G., ed(s)., CRC Press, Inc., Boca Raton, FL, 1989, 1. [all data]
Mellan, 1962
Mellan, I.,
Polyhydric Alcohols, Spartan Books: Washington, DC, 1962. [all data]
Blaine and Levy, 1974
Blaine, Roger L.; Levy, Paul F.,
The Use of Thermal Evolution Analysis (TEA) for the Determination of Vapor Pressure of Agricultural Chemicals, 1974, 185-198, https://doi.org/10.1007/978-1-4757-4509-215
. [all data]
Verevkin, 2007
Verevkin, Sergey P.,
Vapor Pressures and Enthalpies of Vaporization of a Series of the 1,3-Alkanediols,
J. Chem. Eng. Data, 2007, 52, 1, 301-308, https://doi.org/10.1021/je060419q
. [all data]
Welke, Manfroi, et al., 2012
Welke, J.E.; Manfroi, V.; Zanus, M.; Lazarotto, M.; Zini, C.A.,
Characterization of the volatile profile of Brazilian merlot wines through comprehensive two dimensional gas chromatography time-of-flight mass spectrometric detection,
J. Chromatogr. A, 2012, 1226, 124-139, https://doi.org/10.1016/j.chroma.2012.01.002
. [all data]